these 3 derivations will be built: /nix/store/42hi0azz2jhirls40vznqgcack13pg77-start-postgres-server-test.drv /nix/store/nkm0xpscxs33c9967b1gycl2ifgj9hbw-postgres-orioledb-17-check-harness.drv /nix/store/9789zjm9rr0vn6jinmnmnnbc4f7cxpq2-run-check-harness-psql-orioledb-17.drv error: Cannot build '/nix/store/9789zjm9rr0vn6jinmnmnnbc4f7cxpq2-run-check-harness-psql-orioledb-17.drv'. Reason: builder failed with exit code 1. Output paths: /nix/store/2zlgds8sb2cynmp3jdlgayb8x98ag8py-run-check-harness-psql-orioledb-17 Last 25 log lines: > test wal2json ... ok 17 ms > test z_orioledb-17_docs-cascades-deletes ... ok 81 ms > test z_orioledb-17_docs-full-text-search ... ok 32 ms > test z_orioledb-17_docs-functions ... ok 341 ms > test z_orioledb-17_docs-indexes ... ok 27 ms > test z_orioledb-17_docs-partitioning ... ok 38 ms > test z_orioledb-17_ext_interface ... FAILED 110 ms > test z_orioledb-17_extensions_schema ... ok 8 ms > test z_orioledb-17_intarray_ltree_query ... ok 9 ms > test z_orioledb-17_pg_stat_monitor ... ok 7 ms > test z_orioledb-17_pgroonga ... ok 55 ms > test z_orioledb-17_pgvector ... ok 17 ms > test z_orioledb-17_verify_orioledb ... ok 15 ms > > ======================= > 2 of 64 tests failed. > ======================= > > The differences that caused some tests to fail can be viewed in the > file "/nix/store/2zlgds8sb2cynmp3jdlgayb8x98ag8py-run-check-harness-psql-orioledb-17/regression_output/regression.diffs". A copy of the test summary that you see > above is saved in the file "/nix/store/2zlgds8sb2cynmp3jdlgayb8x98ag8py-run-check-harness-psql-orioledb-17/regression_output/regression.out". > > 2026-10-05 10:58:52 [ERROR] pg_regress tests failed > 2026-10-05 10:58:52 [ERROR] An error occurred. Exit code: 1 > 2026-10-05 10:58:52 [ERROR] Debug logs: For full logs, run: nix log /nix/store/9789zjm9rr0vn6jinmnmnnbc4f7cxpq2-run-check-harness-psql-orioledb-17.drv