nixbot

builds

supabase/postgres build #37 failed

branch develop · PR #2433 · commit f9688adf6e · · took 1h 57m · eval 8m 52s

21 failed
failed attributes
status attribute duration
failed checks.aarch64-darwin.ext-pgmq-drop-queue-overload 5m 26s
vm-test-run-pgmq-drop-queue-overload: self.test_script() ~~~~~~~~~~~~~~~~^^ File "/nix/store/rrm86kn8chplygn98lvx1qb0f280f1c5-nixos-test-driver-1.1/li …
vm-test-run-pgmq-drop-queue-overload:
    self.test_script()
    ~~~~~~~~~~~~~~~~^^
  File "/nix/store/rrm86kn8chplygn98lvx1qb0f280f1c5-nixos-test-driver-1.1/lib/python3.13/site-packages/test_driver/driver.py", line 204, in test_script
    exec(self.tests, symbols, None)
    ~~~~^^^^^^^^^^^^^^^^^^^^^^^^^^^
  File "<string>", line 30, in <module>
  File "<string>", line 18, in assert_single_merged_overload
AssertionError: [1.4.4] expected exactly one merged, extension-owned drop_queue(text, boolean)
failed checks.aarch64-darwin.psql_15 5m 38s
run-check-harness-psql-15: 3 of 71 tests failed. ======================= The differences that caused some tests to fail can be viewed in the file "/nix/store/ …
run-check-harness-psql-15:
 3 of 71 tests failed. 
=======================
The differences that caused some tests to fail can be viewed in the
file "/nix/store/53ifnqhlfprzkhhdwj37r2h8qf9kq1rn-run-check-harness-psql-15/regression_output/regression.diffs".  A copy of the test summary that you see
above is saved in the file "/nix/store/53ifnqhlfprzkhhdwj37r2h8qf9kq1rn-run-check-harness-psql-15/regression_output/regression.out".
2026-10-05 10:38:07 [ERROR] pg_regress tests failed
2026-10-05 10:38:07 [ERROR] An error occurred. Exit code: 1
2026-10-05 10:38:07 [ERROR] Debug logs:
failed checks.aarch64-darwin.psql_15_slim 3m 59s
run-check-harness-psql-15-slim: 3 of 71 tests failed. ======================= The differences that caused some tests to fail can be viewed in the file "/nix/s …
run-check-harness-psql-15-slim:
 3 of 71 tests failed. 
=======================
The differences that caused some tests to fail can be viewed in the
file "/nix/store/0a5vk4jhs4zhnhq71dqa31y3k7nsp54g-run-check-harness-psql-15-slim/regression_output/regression.diffs".  A copy of the test summary that you see
above is saved in the file "/nix/store/0a5vk4jhs4zhnhq71dqa31y3k7nsp54g-run-check-harness-psql-15-slim/regression_output/regression.out".
2026-10-05 10:36:28 [ERROR] pg_regress tests failed
2026-10-05 10:36:28 [ERROR] An error occurred. Exit code: 1
2026-10-05 10:36:28 [ERROR] Debug logs:
failed checks.aarch64-darwin.psql_17 4m 13s
run-check-harness-psql-17: 3 of 67 tests failed. ======================= The differences that caused some tests to fail can be viewed in the file "/nix/store/ …
run-check-harness-psql-17:
 3 of 67 tests failed. 
=======================
The differences that caused some tests to fail can be viewed in the
file "/nix/store/2n5nqavmq2ryy18w8hwwl1iqivrgp3mi-run-check-harness-psql-17/regression_output/regression.diffs".  A copy of the test summary that you see
above is saved in the file "/nix/store/2n5nqavmq2ryy18w8hwwl1iqivrgp3mi-run-check-harness-psql-17/regression_output/regression.out".
2026-10-05 10:36:42 [ERROR] pg_regress tests failed
2026-10-05 10:36:42 [ERROR] An error occurred. Exit code: 1
2026-10-05 10:36:42 [ERROR] Debug logs:
failed checks.aarch64-darwin.psql_17_slim 4m 47s
run-check-harness-psql-17-slim: 2 of 67 tests failed. ======================= The differences that caused some tests to fail can be viewed in the file "/nix/s …
run-check-harness-psql-17-slim:
 2 of 67 tests failed. 
=======================
The differences that caused some tests to fail can be viewed in the
file "/nix/store/s18nvgix33djv22sdsb1b2pmy3k5kl7x-run-check-harness-psql-17-slim/regression_output/regression.diffs".  A copy of the test summary that you see
above is saved in the file "/nix/store/s18nvgix33djv22sdsb1b2pmy3k5kl7x-run-check-harness-psql-17-slim/regression_output/regression.out".
2026-10-05 10:37:16 [ERROR] pg_regress tests failed
2026-10-05 10:37:16 [ERROR] An error occurred. Exit code: 1
2026-10-05 10:37:16 [ERROR] Debug logs:
failed checks.aarch64-darwin.psql_orioledb-17 3m 16s
run-check-harness-psql-orioledb-17: 3 of 64 tests failed. ======================= The differences that caused some tests to fail can be viewed in the file "/n …
run-check-harness-psql-orioledb-17:
 3 of 64 tests failed. 
=======================
The differences that caused some tests to fail can be viewed in the
file "/nix/store/qb5bhah8xvmr14ncsf6kvyqndxgx43c7-run-check-harness-psql-orioledb-17/regression_output/regression.diffs".  A copy of the test summary that you see
above is saved in the file "/nix/store/qb5bhah8xvmr14ncsf6kvyqndxgx43c7-run-check-harness-psql-orioledb-17/regression_output/regression.out".
2026-10-05 10:35:44 [ERROR] pg_regress tests failed
2026-10-05 10:35:44 [ERROR] An error occurred. Exit code: 1
2026-10-05 10:35:44 [ERROR] Debug logs:
failed checks.aarch64-darwin.psql_orioledb-17_slim 3m 7s
run-check-harness-psql-orioledb-17-slim: 3 of 64 tests failed. ======================= The differences that caused some tests to fail can be viewed in the fil …
run-check-harness-psql-orioledb-17-slim:
 3 of 64 tests failed. 
=======================
The differences that caused some tests to fail can be viewed in the
file "/nix/store/76rw2hqxx65f58j32c69acvk1j9nlkj5-run-check-harness-psql-orioledb-17-slim/regression_output/regression.diffs".  A copy of the test summary that you see
above is saved in the file "/nix/store/76rw2hqxx65f58j32c69acvk1j9nlkj5-run-check-harness-psql-orioledb-17-slim/regression_output/regression.out".
2026-10-05 10:40:07 [ERROR] pg_regress tests failed
2026-10-05 10:40:07 [ERROR] An error occurred. Exit code: 1
2026-10-05 10:40:07 [ERROR] Debug logs:
failed checks.aarch64-linux.ext-pgmq-drop-queue-overload 36m 3s
vm-test-run-pgmq-drop-queue-overload: ~~~~~~~~~~~~~~~~^^ File "/nix/store/g0d84yfz4dkz7fl2971707c0x6nn88ab-nixos-test-driver-1.1/lib/python3.13/site-packa …
vm-test-run-pgmq-drop-queue-overload:
    ~~~~~~~~~~~~~~~~^^
  File "/nix/store/g0d84yfz4dkz7fl2971707c0x6nn88ab-nixos-test-driver-1.1/lib/python3.13/site-packages/test_driver/driver.py", line 204, in test_script
    exec(self.tests, symbols, None)
    ~~~~^^^^^^^^^^^^^^^^^^^^^^^^^^^
  File "<string>", line 30, in <module>
  File "<string>", line 18, in assert_single_merged_overload
AssertionError: [1.4.4] expected exactly one merged, extension-owned drop_queue(text, boolean)
vde_switch: Caught signal 15, cleaning up and exiting
failed checks.aarch64-linux.psql_15 2m 37s
run-check-harness-psql-15: 2 of 71 tests failed. ======================= The differences that caused some tests to fail can be viewed in the file "/nix/store/ …
run-check-harness-psql-15:
 2 of 71 tests failed. 
=======================
The differences that caused some tests to fail can be viewed in the
file "/nix/store/6y6a9f29ij63vizn8ab85wid4cpw7mjc-run-check-harness-psql-15/regression_output/regression.diffs".  A copy of the test summary that you see
above is saved in the file "/nix/store/6y6a9f29ij63vizn8ab85wid4cpw7mjc-run-check-harness-psql-15/regression_output/regression.out".
2026-10-05 10:40:46 [ERROR] pg_regress tests failed
2026-10-05 10:40:46 [ERROR] An error occurred. Exit code: 1
2026-10-05 10:40:46 [ERROR] Debug logs:
failed checks.aarch64-linux.psql_15_slim 2m 21s
run-check-harness-psql-15-slim: 2 of 71 tests failed. ======================= The differences that caused some tests to fail can be viewed in the file "/nix/s …
run-check-harness-psql-15-slim:
 2 of 71 tests failed. 
=======================
The differences that caused some tests to fail can be viewed in the
file "/nix/store/f2chpsf0b1qfjgbg8hv2bs3iv15fmw7z-run-check-harness-psql-15-slim/regression_output/regression.diffs".  A copy of the test summary that you see
above is saved in the file "/nix/store/f2chpsf0b1qfjgbg8hv2bs3iv15fmw7z-run-check-harness-psql-15-slim/regression_output/regression.out".
2026-10-05 10:38:27 [ERROR] pg_regress tests failed
2026-10-05 10:38:27 [ERROR] An error occurred. Exit code: 1
2026-10-05 10:38:27 [ERROR] Debug logs:
failed checks.aarch64-linux.psql_17 1m 51s
run-check-harness-psql-17: 2 of 67 tests failed. ======================= The differences that caused some tests to fail can be viewed in the file "/nix/store/ …
run-check-harness-psql-17:
 2 of 67 tests failed. 
=======================
The differences that caused some tests to fail can be viewed in the
file "/nix/store/xm747qvxvnd7vz94p60pqsx8m4g1dvi5-run-check-harness-psql-17/regression_output/regression.diffs".  A copy of the test summary that you see
above is saved in the file "/nix/store/xm747qvxvnd7vz94p60pqsx8m4g1dvi5-run-check-harness-psql-17/regression_output/regression.out".
2026-10-05 10:39:56 [ERROR] pg_regress tests failed
2026-10-05 10:39:56 [ERROR] An error occurred. Exit code: 1
2026-10-05 10:39:56 [ERROR] Debug logs:
failed checks.aarch64-linux.psql_17_slim 1m 36s
run-check-harness-psql-17-slim: 2 of 67 tests failed. ======================= The differences that caused some tests to fail can be viewed in the file "/nix/s …
run-check-harness-psql-17-slim:
 2 of 67 tests failed. 
=======================
The differences that caused some tests to fail can be viewed in the
file "/nix/store/zsimyvcw1crplazw5pja6llpnfihmg4d-run-check-harness-psql-17-slim/regression_output/regression.diffs".  A copy of the test summary that you see
above is saved in the file "/nix/store/zsimyvcw1crplazw5pja6llpnfihmg4d-run-check-harness-psql-17-slim/regression_output/regression.out".
2026-10-05 10:39:44 [ERROR] pg_regress tests failed
2026-10-05 10:39:44 [ERROR] An error occurred. Exit code: 1
2026-10-05 10:39:44 [ERROR] Debug logs:
failed checks.aarch64-linux.psql_orioledb-17 1m 53s
run-check-harness-psql-orioledb-17: 2 of 64 tests failed. ======================= The differences that caused some tests to fail can be viewed in the file "/n …
run-check-harness-psql-orioledb-17:
 2 of 64 tests failed. 
=======================
The differences that caused some tests to fail can be viewed in the
file "/nix/store/08yj1k6mr3ghf7qfkrxf3yb1w0q3q7jc-run-check-harness-psql-orioledb-17/regression_output/regression.diffs".  A copy of the test summary that you see
above is saved in the file "/nix/store/08yj1k6mr3ghf7qfkrxf3yb1w0q3q7jc-run-check-harness-psql-orioledb-17/regression_output/regression.out".
2026-10-05 10:38:54 [ERROR] pg_regress tests failed
2026-10-05 10:38:54 [ERROR] An error occurred. Exit code: 1
2026-10-05 10:38:54 [ERROR] Debug logs:
failed checks.aarch64-linux.psql_orioledb-17_slim 1m 38s
run-check-harness-psql-orioledb-17-slim: 2 of 64 tests failed. ======================= The differences that caused some tests to fail can be viewed in the fil …
run-check-harness-psql-orioledb-17-slim:
 2 of 64 tests failed. 
=======================
The differences that caused some tests to fail can be viewed in the
file "/nix/store/0g4p8k3z8jlrfnhxxy2h4y140csxk0s8-run-check-harness-psql-orioledb-17-slim/regression_output/regression.diffs".  A copy of the test summary that you see
above is saved in the file "/nix/store/0g4p8k3z8jlrfnhxxy2h4y140csxk0s8-run-check-harness-psql-orioledb-17-slim/regression_output/regression.out".
2026-10-05 10:37:43 [ERROR] pg_regress tests failed
2026-10-05 10:37:43 [ERROR] An error occurred. Exit code: 1
2026-10-05 10:37:43 [ERROR] Debug logs:
failed checks.x86_64-linux.ext-pgmq-drop-queue-overload 3m 33s
vm-test-run-pgmq-drop-queue-overload: self.test_script() ~~~~~~~~~~~~~~~~^^ File "/nix/store/pnvnl0zh43cvp04dviqz3gmxlz0yrxj7-nixos-test-driver-1.1/li …
vm-test-run-pgmq-drop-queue-overload:
    self.test_script()
    ~~~~~~~~~~~~~~~~^^
  File "/nix/store/pnvnl0zh43cvp04dviqz3gmxlz0yrxj7-nixos-test-driver-1.1/lib/python3.13/site-packages/test_driver/driver.py", line 204, in test_script
    exec(self.tests, symbols, None)
    ~~~~^^^^^^^^^^^^^^^^^^^^^^^^^^^
  File "<string>", line 30, in <module>
  File "<string>", line 18, in assert_single_merged_overload
AssertionError: [1.4.4] expected exactly one merged, extension-owned drop_queue(text, boolean)
failed checks.x86_64-linux.psql_15 2m 8s
run-check-harness-psql-15: 2 of 71 tests failed. ======================= The differences that caused some tests to fail can be viewed in the file "/nix/store/ …
run-check-harness-psql-15:
 2 of 71 tests failed. 
=======================
The differences that caused some tests to fail can be viewed in the
file "/nix/store/xx90ak5nfqljkidbjs6dbmdgzclxkx62-run-check-harness-psql-15/regression_output/regression.diffs".  A copy of the test summary that you see
above is saved in the file "/nix/store/xx90ak5nfqljkidbjs6dbmdgzclxkx62-run-check-harness-psql-15/regression_output/regression.out".
2026-10-05 10:41:05 [ERROR] pg_regress tests failed
2026-10-05 10:41:05 [ERROR] An error occurred. Exit code: 1
2026-10-05 10:41:05 [ERROR] Debug logs:
failed checks.x86_64-linux.psql_15_slim 1m 53s
run-check-harness-psql-15-slim: 2 of 71 tests failed. ======================= The differences that caused some tests to fail can be viewed in the file "/nix/s …
run-check-harness-psql-15-slim:
 2 of 71 tests failed. 
=======================
The differences that caused some tests to fail can be viewed in the
file "/nix/store/yinmgdfq0h2flvk1ahz4slq49vgmab50-run-check-harness-psql-15-slim/regression_output/regression.diffs".  A copy of the test summary that you see
above is saved in the file "/nix/store/yinmgdfq0h2flvk1ahz4slq49vgmab50-run-check-harness-psql-15-slim/regression_output/regression.out".
2026-10-05 10:41:06 [ERROR] pg_regress tests failed
2026-10-05 10:41:06 [ERROR] An error occurred. Exit code: 1
2026-10-05 10:41:06 [ERROR] Debug logs:
failed checks.x86_64-linux.psql_17 1m 38s
run-check-harness-psql-17: 2 of 67 tests failed. ======================= The differences that caused some tests to fail can be viewed in the file "/nix/store/ …
run-check-harness-psql-17:
 2 of 67 tests failed. 
=======================
The differences that caused some tests to fail can be viewed in the
file "/nix/store/2xyblk0grcic0dz8hazx2lgv81dl1bgg-run-check-harness-psql-17/regression_output/regression.diffs".  A copy of the test summary that you see
above is saved in the file "/nix/store/2xyblk0grcic0dz8hazx2lgv81dl1bgg-run-check-harness-psql-17/regression_output/regression.out".
2026-10-05 10:58:04 [ERROR] pg_regress tests failed
2026-10-05 10:58:04 [ERROR] An error occurred. Exit code: 1
2026-10-05 10:58:04 [ERROR] Debug logs:
failed checks.x86_64-linux.psql_17_slim 1m 38s
run-check-harness-psql-17-slim: 2 of 67 tests failed. ======================= The differences that caused some tests to fail can be viewed in the file "/nix/s …
run-check-harness-psql-17-slim:
 2 of 67 tests failed. 
=======================
The differences that caused some tests to fail can be viewed in the
file "/nix/store/z7r0r5ay9r0bm8cdkcgpdbdm17l8lz0j-run-check-harness-psql-17-slim/regression_output/regression.diffs".  A copy of the test summary that you see
above is saved in the file "/nix/store/z7r0r5ay9r0bm8cdkcgpdbdm17l8lz0j-run-check-harness-psql-17-slim/regression_output/regression.out".
2026-10-05 10:41:35 [ERROR] pg_regress tests failed
2026-10-05 10:41:35 [ERROR] An error occurred. Exit code: 1
2026-10-05 10:41:35 [ERROR] Debug logs:
failed checks.x86_64-linux.psql_orioledb-17 1m 39s
run-check-harness-psql-orioledb-17: 2 of 64 tests failed. ======================= The differences that caused some tests to fail can be viewed in the file "/n …
run-check-harness-psql-orioledb-17:
 2 of 64 tests failed. 
=======================
The differences that caused some tests to fail can be viewed in the
file "/nix/store/2zlgds8sb2cynmp3jdlgayb8x98ag8py-run-check-harness-psql-orioledb-17/regression_output/regression.diffs".  A copy of the test summary that you see
above is saved in the file "/nix/store/2zlgds8sb2cynmp3jdlgayb8x98ag8py-run-check-harness-psql-orioledb-17/regression_output/regression.out".
2026-10-05 10:58:52 [ERROR] pg_regress tests failed
2026-10-05 10:58:52 [ERROR] An error occurred. Exit code: 1
2026-10-05 10:58:52 [ERROR] Debug logs:
failed checks.x86_64-linux.psql_orioledb-17_slim 1m 23s
run-check-harness-psql-orioledb-17-slim: 2 of 64 tests failed. ======================= The differences that caused some tests to fail can be viewed in the fil …
run-check-harness-psql-orioledb-17-slim:
 2 of 64 tests failed. 
=======================
The differences that caused some tests to fail can be viewed in the
file "/nix/store/aw7cyfiya1z8d3isvx1d2bqxbc52zjx6-run-check-harness-psql-orioledb-17-slim/regression_output/regression.diffs".  A copy of the test summary that you see
above is saved in the file "/nix/store/aw7cyfiya1z8d3isvx1d2bqxbc52zjx6-run-check-harness-psql-orioledb-17-slim/regression_output/regression.out".
2026-10-05 10:56:26 [ERROR] pg_regress tests failed
2026-10-05 10:56:26 [ERROR] An error occurred. Exit code: 1
2026-10-05 10:56:26 [ERROR] Debug logs:
105 succeeded
succeeded attributes
status attribute duration
loading…
53 already built
skipped attributes
status attribute duration
loading…