nixbot

builds
1these 3 derivations will be built:2 /nix/store/sc7wals5y5ydljy8rymvbhlynzlpizh0-start-postgres-server-test.drv3 /nix/store/lxpdg4dw6wm4fx26dm92q8akb72d79qg-postgres-15-check-harness.drv4 /nix/store/223174hhai0nr61s36xq5znm22nja3qm-run-check-harness-psql-15-slim.drv5error: Cannot build '/nix/store/223174hhai0nr61s36xq5znm22nja3qm-run-check-harness-psql-15-slim.drv'.6 Reason: builder failed with exit code 1.7 Output paths:8 /nix/store/yinmgdfq0h2flvk1ahz4slq49vgmab50-run-check-harness-psql-15-slim9 Last 25 log lines:10 > test supautils_restrict_versions ... ok 76 ms11 > test vault ... ok 25 ms12 > test wal2json ... ok 12 ms13 > test z_15_ext_interface ... FAILED 636 ms14 > test z_15_intarray_ltree_query ... ok 10 ms15 > test z_15_pg_stat_monitor ... ok 10 ms16 > test z_15_pgjwt ... ok 17 ms17 > test z_15_pgvector ... ok 34 ms18 > test z_15_plv8 ... ok 47 ms19 > test z_15_roles ... ok 17 ms20 > test z_15_rum ... ok 20 ms21 > test z_15_timescale ... ok 21 ms22 > test z_15_unhype_timescale_to_partman ... ok 12688 ms23 >24 > =======================25 > 2 of 71 tests failed.26 > =======================27 >28 > The differences that caused some tests to fail can be viewed in the29 > file "/nix/store/yinmgdfq0h2flvk1ahz4slq49vgmab50-run-check-harness-psql-15-slim/regression_output/regression.diffs". A copy of the test summary that you see30 > above is saved in the file "/nix/store/yinmgdfq0h2flvk1ahz4slq49vgmab50-run-check-harness-psql-15-slim/regression_output/regression.out".31 >32 > 2026-10-05 10:41:06 [ERROR] pg_regress tests failed33 > 2026-10-05 10:41:06 [ERROR] An error occurred. Exit code: 134 > 2026-10-05 10:41:06 [ERROR] Debug logs:35 For full logs, run:36 nix log /nix/store/223174hhai0nr61s36xq5znm22nja3qm-run-check-harness-psql-15-slim.drv