these 3 derivations will be built: /nix/store/sc7wals5y5ydljy8rymvbhlynzlpizh0-start-postgres-server-test.drv /nix/store/lxpdg4dw6wm4fx26dm92q8akb72d79qg-postgres-15-check-harness.drv /nix/store/223174hhai0nr61s36xq5znm22nja3qm-run-check-harness-psql-15-slim.drv error: Cannot build '/nix/store/223174hhai0nr61s36xq5znm22nja3qm-run-check-harness-psql-15-slim.drv'. Reason: builder failed with exit code 1. Output paths: /nix/store/yinmgdfq0h2flvk1ahz4slq49vgmab50-run-check-harness-psql-15-slim Last 25 log lines: > test supautils_restrict_versions ... ok 76 ms > test vault ... ok 25 ms > test wal2json ... ok 12 ms > test z_15_ext_interface ... FAILED 636 ms > test z_15_intarray_ltree_query ... ok 10 ms > test z_15_pg_stat_monitor ... ok 10 ms > test z_15_pgjwt ... ok 17 ms > test z_15_pgvector ... ok 34 ms > test z_15_plv8 ... ok 47 ms > test z_15_roles ... ok 17 ms > test z_15_rum ... ok 20 ms > test z_15_timescale ... ok 21 ms > test z_15_unhype_timescale_to_partman ... ok 12688 ms > > ======================= > 2 of 71 tests failed. > ======================= > > The differences that caused some tests to fail can be viewed in the > file "/nix/store/yinmgdfq0h2flvk1ahz4slq49vgmab50-run-check-harness-psql-15-slim/regression_output/regression.diffs". A copy of the test summary that you see > above is saved in the file "/nix/store/yinmgdfq0h2flvk1ahz4slq49vgmab50-run-check-harness-psql-15-slim/regression_output/regression.out". > > 2026-10-05 10:41:06 [ERROR] pg_regress tests failed > 2026-10-05 10:41:06 [ERROR] An error occurred. Exit code: 1 > 2026-10-05 10:41:06 [ERROR] Debug logs: For full logs, run: nix log /nix/store/223174hhai0nr61s36xq5znm22nja3qm-run-check-harness-psql-15-slim.drv