nixbot

builds

succeeded setup checks.x86_64-linux.psql_15 · build #37 · raw

1these 3 derivations will be built:2 /nix/store/h30rjjp3xljbk85hapwm07sybmb428bx-start-postgres-server-test.drv3 /nix/store/r8n34vzhklsb996hkg03pl07wpca6ajb-postgres-15-check-harness.drv4 /nix/store/kr1rb57a6xa5lc3ax3yal38j4a15m6ya-run-check-harness-psql-15.drv5error: Cannot build '/nix/store/kr1rb57a6xa5lc3ax3yal38j4a15m6ya-run-check-harness-psql-15.drv'.6 Reason: builder failed with exit code 1.7 Output paths:8 /nix/store/xx90ak5nfqljkidbjs6dbmdgzclxkx62-run-check-harness-psql-159 Last 25 log lines:10 > test supautils_restrict_versions ... ok 76 ms11 > test vault ... ok 26 ms12 > test wal2json ... ok 13 ms13 > test z_15_ext_interface ... FAILED 649 ms14 > test z_15_intarray_ltree_query ... ok 11 ms15 > test z_15_pg_stat_monitor ... ok 9 ms16 > test z_15_pgjwt ... ok 16 ms17 > test z_15_pgvector ... ok 35 ms18 > test z_15_plv8 ... ok 52 ms19 > test z_15_roles ... ok 15 ms20 > test z_15_rum ... ok 16 ms21 > test z_15_timescale ... ok 20 ms22 > test z_15_unhype_timescale_to_partman ... ok 11864 ms23 >24 > =======================25 > 2 of 71 tests failed.26 > =======================27 >28 > The differences that caused some tests to fail can be viewed in the29 > file "/nix/store/xx90ak5nfqljkidbjs6dbmdgzclxkx62-run-check-harness-psql-15/regression_output/regression.diffs". A copy of the test summary that you see30 > above is saved in the file "/nix/store/xx90ak5nfqljkidbjs6dbmdgzclxkx62-run-check-harness-psql-15/regression_output/regression.out".31 >32 > 2026-10-05 10:41:05 [ERROR] pg_regress tests failed33 > 2026-10-05 10:41:05 [ERROR] An error occurred. Exit code: 134 > 2026-10-05 10:41:05 [ERROR] Debug logs:35 For full logs, run:36 nix log /nix/store/kr1rb57a6xa5lc3ax3yal38j4a15m6ya-run-check-harness-psql-15.drv