these 3 derivations will be built: /nix/store/h30rjjp3xljbk85hapwm07sybmb428bx-start-postgres-server-test.drv /nix/store/r8n34vzhklsb996hkg03pl07wpca6ajb-postgres-15-check-harness.drv /nix/store/kr1rb57a6xa5lc3ax3yal38j4a15m6ya-run-check-harness-psql-15.drv error: Cannot build '/nix/store/kr1rb57a6xa5lc3ax3yal38j4a15m6ya-run-check-harness-psql-15.drv'. Reason: builder failed with exit code 1. Output paths: /nix/store/xx90ak5nfqljkidbjs6dbmdgzclxkx62-run-check-harness-psql-15 Last 25 log lines: > test supautils_restrict_versions ... ok 76 ms > test vault ... ok 26 ms > test wal2json ... ok 13 ms > test z_15_ext_interface ... FAILED 649 ms > test z_15_intarray_ltree_query ... ok 11 ms > test z_15_pg_stat_monitor ... ok 9 ms > test z_15_pgjwt ... ok 16 ms > test z_15_pgvector ... ok 35 ms > test z_15_plv8 ... ok 52 ms > test z_15_roles ... ok 15 ms > test z_15_rum ... ok 16 ms > test z_15_timescale ... ok 20 ms > test z_15_unhype_timescale_to_partman ... ok 11864 ms > > ======================= > 2 of 71 tests failed. > ======================= > > The differences that caused some tests to fail can be viewed in the > file "/nix/store/xx90ak5nfqljkidbjs6dbmdgzclxkx62-run-check-harness-psql-15/regression_output/regression.diffs". A copy of the test summary that you see > above is saved in the file "/nix/store/xx90ak5nfqljkidbjs6dbmdgzclxkx62-run-check-harness-psql-15/regression_output/regression.out". > > 2026-10-05 10:41:05 [ERROR] pg_regress tests failed > 2026-10-05 10:41:05 [ERROR] An error occurred. Exit code: 1 > 2026-10-05 10:41:05 [ERROR] Debug logs: For full logs, run: nix log /nix/store/kr1rb57a6xa5lc3ax3yal38j4a15m6ya-run-check-harness-psql-15.drv