1these 2 derivations will be built:2 /nix/store/2yar9bxbhbckmi5zgvyvkk8vllj5kaf4-postgres-orioledb-17-check-harness.drv3 /nix/store/7wmssisfhl0nw99rhhkfwvj47nv685ic-run-check-harness-psql-orioledb-17.drv4error: Cannot build '/nix/store/7wmssisfhl0nw99rhhkfwvj47nv685ic-run-check-harness-psql-orioledb-17.drv'.5 Reason: builder failed with exit code 1.6 Output paths:7 /nix/store/2w5n0q7jsph89h5p4iv20vqki8dib2sj-run-check-harness-psql-orioledb-178 Last 25 log lines:9 > test wal2json ... ok 21 ms10 > test z_orioledb-17_docs-cascades-deletes ... ok 90 ms11 > test z_orioledb-17_docs-full-text-search ... ok 32 ms12 > test z_orioledb-17_docs-functions ... ok 392 ms13 > test z_orioledb-17_docs-indexes ... ok 33 ms14 > test z_orioledb-17_docs-partitioning ... ok 47 ms15 > test z_orioledb-17_ext_interface ... ok 151 ms16 > test z_orioledb-17_extensions_schema ... ok 10 ms17 > test z_orioledb-17_intarray_ltree_query ... ok 10 ms18 > test z_orioledb-17_pg_stat_monitor ... ok 8 ms19 > test z_orioledb-17_pgroonga ... ok 69 ms20 > test z_orioledb-17_pgvector ... ok 19 ms21 > test z_orioledb-17_verify_orioledb ... ok 18 ms22 >23 > =======================24 > 1 of 65 tests failed.25 > =======================26 >27 > The differences that caused some tests to fail can be viewed in the28 > file "/nix/store/2w5n0q7jsph89h5p4iv20vqki8dib2sj-run-check-harness-psql-orioledb-17/regression_output/regression.diffs". A copy of the test summary that you see29 > above is saved in the file "/nix/store/2w5n0q7jsph89h5p4iv20vqki8dib2sj-run-check-harness-psql-orioledb-17/regression_output/regression.out".30 >31 > 2026-10-10 14:44:08 [ERROR] pg_regress tests failed32 > 2026-10-10 14:44:08 [ERROR] An error occurred. Exit code: 133 > 2026-10-10 14:44:08 [ERROR] Debug logs:34 For full logs, run:35 nix log /nix/store/7wmssisfhl0nw99rhhkfwvj47nv685ic-run-check-harness-psql-orioledb-17.drv