these 2 derivations will be built: /nix/store/2yar9bxbhbckmi5zgvyvkk8vllj5kaf4-postgres-orioledb-17-check-harness.drv /nix/store/7wmssisfhl0nw99rhhkfwvj47nv685ic-run-check-harness-psql-orioledb-17.drv error: Cannot build '/nix/store/7wmssisfhl0nw99rhhkfwvj47nv685ic-run-check-harness-psql-orioledb-17.drv'. Reason: builder failed with exit code 1. Output paths: /nix/store/2w5n0q7jsph89h5p4iv20vqki8dib2sj-run-check-harness-psql-orioledb-17 Last 25 log lines: > test wal2json ... ok 21 ms > test z_orioledb-17_docs-cascades-deletes ... ok 90 ms > test z_orioledb-17_docs-full-text-search ... ok 32 ms > test z_orioledb-17_docs-functions ... ok 392 ms > test z_orioledb-17_docs-indexes ... ok 33 ms > test z_orioledb-17_docs-partitioning ... ok 47 ms > test z_orioledb-17_ext_interface ... ok 151 ms > test z_orioledb-17_extensions_schema ... ok 10 ms > test z_orioledb-17_intarray_ltree_query ... ok 10 ms > test z_orioledb-17_pg_stat_monitor ... ok 8 ms > test z_orioledb-17_pgroonga ... ok 69 ms > test z_orioledb-17_pgvector ... ok 19 ms > test z_orioledb-17_verify_orioledb ... ok 18 ms > > ======================= > 1 of 65 tests failed. > ======================= > > The differences that caused some tests to fail can be viewed in the > file "/nix/store/2w5n0q7jsph89h5p4iv20vqki8dib2sj-run-check-harness-psql-orioledb-17/regression_output/regression.diffs". A copy of the test summary that you see > above is saved in the file "/nix/store/2w5n0q7jsph89h5p4iv20vqki8dib2sj-run-check-harness-psql-orioledb-17/regression_output/regression.out". > > 2026-10-10 14:44:08 [ERROR] pg_regress tests failed > 2026-10-10 14:44:08 [ERROR] An error occurred. Exit code: 1 > 2026-10-10 14:44:08 [ERROR] Debug logs: For full logs, run: nix log /nix/store/7wmssisfhl0nw99rhhkfwvj47nv685ic-run-check-harness-psql-orioledb-17.drv