nixbot

builds

supabase/postgres build #327 failed

branch develop · PR #2105 · commit 1b65b33bd4 · · took 36m 0s · eval 7m 27s

12 failed
failed attributes
status attribute duration
failed checks.aarch64-linux.psql_15 1m 53s
run-check-harness-psql-15: 1 of 72 tests failed. ======================= The differences that caused some tests to fail can be viewed in the file "/nix/store/ …
run-check-harness-psql-15:
 1 of 72 tests failed. 
=======================
The differences that caused some tests to fail can be viewed in the
file "/nix/store/vmlw08y8svrggyfx0cr26y9ksalnlbkv-run-check-harness-psql-15/regression_output/regression.diffs".  A copy of the test summary that you see
above is saved in the file "/nix/store/vmlw08y8svrggyfx0cr26y9ksalnlbkv-run-check-harness-psql-15/regression_output/regression.out".
2026-10-10 14:42:11 [ERROR] pg_regress tests failed
2026-10-10 14:42:11 [ERROR] An error occurred. Exit code: 1
2026-10-10 14:42:11 [ERROR] Debug logs:
failed checks.aarch64-linux.psql_15_slim 1m 53s
run-check-harness-psql-15-slim: 1 of 72 tests failed. ======================= The differences that caused some tests to fail can be viewed in the file "/nix/s …
run-check-harness-psql-15-slim:
 1 of 72 tests failed. 
=======================
The differences that caused some tests to fail can be viewed in the
file "/nix/store/7i42ik59gkky7ifgd187ldb9xkyw6vki-run-check-harness-psql-15-slim/regression_output/regression.diffs".  A copy of the test summary that you see
above is saved in the file "/nix/store/7i42ik59gkky7ifgd187ldb9xkyw6vki-run-check-harness-psql-15-slim/regression_output/regression.out".
2026-10-10 14:42:11 [ERROR] pg_regress tests failed
2026-10-10 14:42:11 [ERROR] An error occurred. Exit code: 1
2026-10-10 14:42:11 [ERROR] Debug logs:
failed checks.aarch64-linux.psql_17 1m 8s
run-check-harness-psql-17: 1 of 68 tests failed. ======================= The differences that caused some tests to fail can be viewed in the file "/nix/store/ …
run-check-harness-psql-17:
 1 of 68 tests failed. 
=======================
The differences that caused some tests to fail can be viewed in the
file "/nix/store/zasgs560vz4jsi2kz4sgkd8raw222yy2-run-check-harness-psql-17/regression_output/regression.diffs".  A copy of the test summary that you see
above is saved in the file "/nix/store/zasgs560vz4jsi2kz4sgkd8raw222yy2-run-check-harness-psql-17/regression_output/regression.out".
2026-10-10 14:41:26 [ERROR] pg_regress tests failed
2026-10-10 14:41:26 [ERROR] An error occurred. Exit code: 1
2026-10-10 14:41:26 [ERROR] Debug logs:
failed checks.aarch64-linux.psql_17_slim 1m 3s
run-check-harness-psql-17-slim: 1 of 68 tests failed. ======================= The differences that caused some tests to fail can be viewed in the file "/nix/s …
run-check-harness-psql-17-slim:
 1 of 68 tests failed. 
=======================
The differences that caused some tests to fail can be viewed in the
file "/nix/store/gc0bzr35g1wabsv5jmbbna4jvla5jfrx-run-check-harness-psql-17-slim/regression_output/regression.diffs".  A copy of the test summary that you see
above is saved in the file "/nix/store/gc0bzr35g1wabsv5jmbbna4jvla5jfrx-run-check-harness-psql-17-slim/regression_output/regression.out".
2026-10-10 14:41:21 [ERROR] pg_regress tests failed
2026-10-10 14:41:21 [ERROR] An error occurred. Exit code: 1
2026-10-10 14:41:21 [ERROR] Debug logs:
failed checks.aarch64-linux.psql_orioledb-17 1m 25s
run-check-harness-psql-orioledb-17: 1 of 65 tests failed. ======================= The differences that caused some tests to fail can be viewed in the file "/n …
run-check-harness-psql-orioledb-17:
 1 of 65 tests failed. 
=======================
The differences that caused some tests to fail can be viewed in the
file "/nix/store/p0qxhx98pqjls3na9fvf8acn7gfwncfv-run-check-harness-psql-orioledb-17/regression_output/regression.diffs".  A copy of the test summary that you see
above is saved in the file "/nix/store/p0qxhx98pqjls3na9fvf8acn7gfwncfv-run-check-harness-psql-orioledb-17/regression_output/regression.out".
2026-10-10 14:41:43 [ERROR] pg_regress tests failed
2026-10-10 14:41:43 [ERROR] An error occurred. Exit code: 1
2026-10-10 14:41:44 [ERROR] Debug logs:
failed checks.aarch64-linux.psql_orioledb-17_slim 48s
run-check-harness-psql-orioledb-17-slim: 1 of 65 tests failed. ======================= The differences that caused some tests to fail can be viewed in the fil …
run-check-harness-psql-orioledb-17-slim:
 1 of 65 tests failed. 
=======================
The differences that caused some tests to fail can be viewed in the
file "/nix/store/17ql4bkqc66yb23b9hbw3nljq8iwfjn1-run-check-harness-psql-orioledb-17-slim/regression_output/regression.diffs".  A copy of the test summary that you see
above is saved in the file "/nix/store/17ql4bkqc66yb23b9hbw3nljq8iwfjn1-run-check-harness-psql-orioledb-17-slim/regression_output/regression.out".
2026-10-10 14:41:06 [ERROR] pg_regress tests failed
2026-10-10 14:41:06 [ERROR] An error occurred. Exit code: 1
2026-10-10 14:41:06 [ERROR] Debug logs:
failed checks.x86_64-linux.psql_15 1m 1s
run-check-harness-psql-15: 1 of 72 tests failed. ======================= The differences that caused some tests to fail can be viewed in the file "/nix/store/ …
run-check-harness-psql-15:
 1 of 72 tests failed. 
=======================
The differences that caused some tests to fail can be viewed in the
file "/nix/store/k9jh8ns0yq2vgbpdaf2c0hy4ykx6wzhm-run-check-harness-psql-15/regression_output/regression.diffs".  A copy of the test summary that you see
above is saved in the file "/nix/store/k9jh8ns0yq2vgbpdaf2c0hy4ykx6wzhm-run-check-harness-psql-15/regression_output/regression.out".
2026-10-10 14:44:44 [ERROR] pg_regress tests failed
2026-10-10 14:44:44 [ERROR] An error occurred. Exit code: 1
2026-10-10 14:44:44 [ERROR] Debug logs:
failed checks.x86_64-linux.psql_15_slim 1m 3s
run-check-harness-psql-15-slim: 1 of 72 tests failed. ======================= The differences that caused some tests to fail can be viewed in the file "/nix/s …
run-check-harness-psql-15-slim:
 1 of 72 tests failed. 
=======================
The differences that caused some tests to fail can be viewed in the
file "/nix/store/bp1s62bpzjkc2sd0shxdag1z4m68ynwk-run-check-harness-psql-15-slim/regression_output/regression.diffs".  A copy of the test summary that you see
above is saved in the file "/nix/store/bp1s62bpzjkc2sd0shxdag1z4m68ynwk-run-check-harness-psql-15-slim/regression_output/regression.out".
2026-10-10 14:44:32 [ERROR] pg_regress tests failed
2026-10-10 14:44:32 [ERROR] An error occurred. Exit code: 1
2026-10-10 14:44:32 [ERROR] Debug logs:
failed checks.x86_64-linux.psql_17 33s
run-check-harness-psql-17: 1 of 68 tests failed. ======================= The differences that caused some tests to fail can be viewed in the file "/nix/store/ …
run-check-harness-psql-17:
 1 of 68 tests failed. 
=======================
The differences that caused some tests to fail can be viewed in the
file "/nix/store/1md77ybihpysk5pqfrgysf9zvn8dpwg3-run-check-harness-psql-17/regression_output/regression.diffs".  A copy of the test summary that you see
above is saved in the file "/nix/store/1md77ybihpysk5pqfrgysf9zvn8dpwg3-run-check-harness-psql-17/regression_output/regression.out".
2026-10-10 14:44:03 [ERROR] pg_regress tests failed
2026-10-10 14:44:03 [ERROR] An error occurred. Exit code: 1
2026-10-10 14:44:04 [ERROR] Debug logs:
failed checks.x86_64-linux.psql_17_slim 33s
run-check-harness-psql-17-slim: 1 of 68 tests failed. ======================= The differences that caused some tests to fail can be viewed in the file "/nix/s …
run-check-harness-psql-17-slim:
 1 of 68 tests failed. 
=======================
The differences that caused some tests to fail can be viewed in the
file "/nix/store/0lk77ajllq92chivww0kd71fbyqpidrv-run-check-harness-psql-17-slim/regression_output/regression.diffs".  A copy of the test summary that you see
above is saved in the file "/nix/store/0lk77ajllq92chivww0kd71fbyqpidrv-run-check-harness-psql-17-slim/regression_output/regression.out".
2026-10-10 14:44:03 [ERROR] pg_regress tests failed
2026-10-10 14:44:03 [ERROR] An error occurred. Exit code: 1
2026-10-10 14:44:03 [ERROR] Debug logs:
failed checks.x86_64-linux.psql_orioledb-17 36s
run-check-harness-psql-orioledb-17: 1 of 65 tests failed. ======================= The differences that caused some tests to fail can be viewed in the file "/n …
run-check-harness-psql-orioledb-17:
 1 of 65 tests failed. 
=======================
The differences that caused some tests to fail can be viewed in the
file "/nix/store/2w5n0q7jsph89h5p4iv20vqki8dib2sj-run-check-harness-psql-orioledb-17/regression_output/regression.diffs".  A copy of the test summary that you see
above is saved in the file "/nix/store/2w5n0q7jsph89h5p4iv20vqki8dib2sj-run-check-harness-psql-orioledb-17/regression_output/regression.out".
2026-10-10 14:44:08 [ERROR] pg_regress tests failed
2026-10-10 14:44:08 [ERROR] An error occurred. Exit code: 1
2026-10-10 14:44:08 [ERROR] Debug logs:
failed checks.x86_64-linux.psql_orioledb-17_slim 33s
run-check-harness-psql-orioledb-17-slim: 1 of 65 tests failed. ======================= The differences that caused some tests to fail can be viewed in the fil …
run-check-harness-psql-orioledb-17-slim:
 1 of 65 tests failed. 
=======================
The differences that caused some tests to fail can be viewed in the
file "/nix/store/73kvl4py5mfr095q2wy8jfwqr12khf56-run-check-harness-psql-orioledb-17-slim/regression_output/regression.diffs".  A copy of the test summary that you see
above is saved in the file "/nix/store/73kvl4py5mfr095q2wy8jfwqr12khf56-run-check-harness-psql-orioledb-17-slim/regression_output/regression.out".
2026-10-10 14:44:13 [ERROR] pg_regress tests failed
2026-10-10 14:44:13 [ERROR] An error occurred. Exit code: 1
2026-10-10 14:44:13 [ERROR] Debug logs:
62 succeeded
succeeded attributes
status attribute duration
loading…
48 already built
skipped attributes
status attribute duration
loading…