setup
checks.x86_64-linux.psql_17_slim
· build #327
· raw
1this derivation will be built:2 /nix/store/bvjb8f11skqnsp0iywn2hzn4bwkj4x2i-run-check-harness-psql-17-slim.drv3this path will be fetched (4.5 KiB download, 16.1 KiB unpacked):4 /nix/store/6n5628js414z1xgdl8vmyjdbkk1jac7n-postgres-17-check-harness5error: Cannot build '/nix/store/bvjb8f11skqnsp0iywn2hzn4bwkj4x2i-run-check-harness-psql-17-slim.drv'.6 Reason: builder failed with exit code 1.7 Output paths:8 /nix/store/0lk77ajllq92chivww0kd71fbyqpidrv-run-check-harness-psql-17-slim9 Last 25 log lines:10 > test roles ... FAILED 13 ms11 > test security ... ok 13 ms12 > test storage ... ok 20 ms13 > test supautils_reserved_roles ... ok 8 ms14 > test supautils_restrict_versions ... ok 98 ms15 > test vault ... ok 36 ms16 > test wal2json ... ok 80 ms17 > test z_17_ext_interface ... ok 117 ms18 > test z_17_intarray_ltree_query ... ok 13 ms19 > test z_17_pg_stat_monitor ... ok 8 ms20 > test z_17_pgvector ... ok 20 ms21 > test z_17_roles ... ok 16 ms22 > test z_17_rum ... ok 14 ms23 >24 > =======================25 > 1 of 68 tests failed.26 > =======================27 >28 > The differences that caused some tests to fail can be viewed in the29 > file "/nix/store/0lk77ajllq92chivww0kd71fbyqpidrv-run-check-harness-psql-17-slim/regression_output/regression.diffs". A copy of the test summary that you see30 > above is saved in the file "/nix/store/0lk77ajllq92chivww0kd71fbyqpidrv-run-check-harness-psql-17-slim/regression_output/regression.out".31 >32 > 2026-10-10 14:44:03 [ERROR] pg_regress tests failed33 > 2026-10-10 14:44:03 [ERROR] An error occurred. Exit code: 134 > 2026-10-10 14:44:03 [ERROR] Debug logs:35 For full logs, run:36 nix log /nix/store/bvjb8f11skqnsp0iywn2hzn4bwkj4x2i-run-check-harness-psql-17-slim.drv