this derivation will be built: /nix/store/bvjb8f11skqnsp0iywn2hzn4bwkj4x2i-run-check-harness-psql-17-slim.drv this path will be fetched (4.5 KiB download, 16.1 KiB unpacked): /nix/store/6n5628js414z1xgdl8vmyjdbkk1jac7n-postgres-17-check-harness error: Cannot build '/nix/store/bvjb8f11skqnsp0iywn2hzn4bwkj4x2i-run-check-harness-psql-17-slim.drv'. Reason: builder failed with exit code 1. Output paths: /nix/store/0lk77ajllq92chivww0kd71fbyqpidrv-run-check-harness-psql-17-slim Last 25 log lines: > test roles ... FAILED 13 ms > test security ... ok 13 ms > test storage ... ok 20 ms > test supautils_reserved_roles ... ok 8 ms > test supautils_restrict_versions ... ok 98 ms > test vault ... ok 36 ms > test wal2json ... ok 80 ms > test z_17_ext_interface ... ok 117 ms > test z_17_intarray_ltree_query ... ok 13 ms > test z_17_pg_stat_monitor ... ok 8 ms > test z_17_pgvector ... ok 20 ms > test z_17_roles ... ok 16 ms > test z_17_rum ... ok 14 ms > > ======================= > 1 of 68 tests failed. > ======================= > > The differences that caused some tests to fail can be viewed in the > file "/nix/store/0lk77ajllq92chivww0kd71fbyqpidrv-run-check-harness-psql-17-slim/regression_output/regression.diffs". A copy of the test summary that you see > above is saved in the file "/nix/store/0lk77ajllq92chivww0kd71fbyqpidrv-run-check-harness-psql-17-slim/regression_output/regression.out". > > 2026-10-10 14:44:03 [ERROR] pg_regress tests failed > 2026-10-10 14:44:03 [ERROR] An error occurred. Exit code: 1 > 2026-10-10 14:44:03 [ERROR] Debug logs: For full logs, run: nix log /nix/store/bvjb8f11skqnsp0iywn2hzn4bwkj4x2i-run-check-harness-psql-17-slim.drv