nixbot

builds
1this derivation will be built:2 /nix/store/02g6hag73p6gh21hrb295myl1r4kqvsp-run-check-harness-psql-15-slim.drv3this path will be fetched (4.5 KiB download, 16.2 KiB unpacked):4 /nix/store/28yj2rzl4k7nbsp4h9397zjkd4zfayx5-postgres-15-check-harness5error: Cannot build '/nix/store/02g6hag73p6gh21hrb295myl1r4kqvsp-run-check-harness-psql-15-slim.drv'.6 Reason: builder failed with exit code 1.7 Output paths:8 /nix/store/bp1s62bpzjkc2sd0shxdag1z4m68ynwk-run-check-harness-psql-15-slim9 Last 25 log lines:10 > test supautils_restrict_versions ... ok 96 ms11 > test vault ... ok 31 ms12 > test wal2json ... ok 15 ms13 > test z_15_ext_interface ... ok 629 ms14 > test z_15_intarray_ltree_query ... ok 10 ms15 > test z_15_pg_stat_monitor ... ok 11 ms16 > test z_15_pgjwt ... ok 17 ms17 > test z_15_pgvector ... ok 36 ms18 > test z_15_plv8 ... ok 47 ms19 > test z_15_roles ... ok 17 ms20 > test z_15_rum ... ok 20 ms21 > test z_15_timescale ... ok 22 ms22 > test z_15_unhype_timescale_to_partman ... ok 11746 ms23 >24 > =======================25 > 1 of 72 tests failed.26 > =======================27 >28 > The differences that caused some tests to fail can be viewed in the29 > file "/nix/store/bp1s62bpzjkc2sd0shxdag1z4m68ynwk-run-check-harness-psql-15-slim/regression_output/regression.diffs". A copy of the test summary that you see30 > above is saved in the file "/nix/store/bp1s62bpzjkc2sd0shxdag1z4m68ynwk-run-check-harness-psql-15-slim/regression_output/regression.out".31 >32 > 2026-10-10 14:44:32 [ERROR] pg_regress tests failed33 > 2026-10-10 14:44:32 [ERROR] An error occurred. Exit code: 134 > 2026-10-10 14:44:32 [ERROR] Debug logs:35 For full logs, run:36 nix log /nix/store/02g6hag73p6gh21hrb295myl1r4kqvsp-run-check-harness-psql-15-slim.drv