this derivation will be built: /nix/store/02g6hag73p6gh21hrb295myl1r4kqvsp-run-check-harness-psql-15-slim.drv this path will be fetched (4.5 KiB download, 16.2 KiB unpacked): /nix/store/28yj2rzl4k7nbsp4h9397zjkd4zfayx5-postgres-15-check-harness error: Cannot build '/nix/store/02g6hag73p6gh21hrb295myl1r4kqvsp-run-check-harness-psql-15-slim.drv'. Reason: builder failed with exit code 1. Output paths: /nix/store/bp1s62bpzjkc2sd0shxdag1z4m68ynwk-run-check-harness-psql-15-slim Last 25 log lines: > test supautils_restrict_versions ... ok 96 ms > test vault ... ok 31 ms > test wal2json ... ok 15 ms > test z_15_ext_interface ... ok 629 ms > test z_15_intarray_ltree_query ... ok 10 ms > test z_15_pg_stat_monitor ... ok 11 ms > test z_15_pgjwt ... ok 17 ms > test z_15_pgvector ... ok 36 ms > test z_15_plv8 ... ok 47 ms > test z_15_roles ... ok 17 ms > test z_15_rum ... ok 20 ms > test z_15_timescale ... ok 22 ms > test z_15_unhype_timescale_to_partman ... ok 11746 ms > > ======================= > 1 of 72 tests failed. > ======================= > > The differences that caused some tests to fail can be viewed in the > file "/nix/store/bp1s62bpzjkc2sd0shxdag1z4m68ynwk-run-check-harness-psql-15-slim/regression_output/regression.diffs". A copy of the test summary that you see > above is saved in the file "/nix/store/bp1s62bpzjkc2sd0shxdag1z4m68ynwk-run-check-harness-psql-15-slim/regression_output/regression.out". > > 2026-10-10 14:44:32 [ERROR] pg_regress tests failed > 2026-10-10 14:44:32 [ERROR] An error occurred. Exit code: 1 > 2026-10-10 14:44:32 [ERROR] Debug logs: For full logs, run: nix log /nix/store/02g6hag73p6gh21hrb295myl1r4kqvsp-run-check-harness-psql-15-slim.drv