setup
checks.aarch64-linux.psql_17_slim
· build #327
· raw
1these 2 derivations will be built:2 /nix/store/gipsy7ckimlxlyx99fp9f415yi8zcpvl-postgres-17-check-harness.drv3 /nix/store/1v495sbam57c0x3fxi60bgxb0jhr61h1-run-check-harness-psql-17-slim.drv4error: build of '/nix/store/1v495sbam57c0x3fxi60bgxb0jhr61h1-run-check-harness-psql-17-slim.drv' on 'ssh-ng://nixbot-remote-build@78.232.36.247' failed: Cannot build '/nix/store/1v495sbam57c0x3fxi60bgxb0jhr61h1-run-check-harness-psql-17-slim.drv'.5 Reason: builder failed with exit code 1.6 Output paths:7 /nix/store/gc0bzr35g1wabsv5jmbbna4jvla5jfrx-run-check-harness-psql-17-slim8 Last 25 log lines:9 > test roles ... FAILED 18 ms10 > test security ... ok 14 ms11 > test storage ... ok 28 ms12 > test supautils_reserved_roles ... ok 11 ms13 > test supautils_restrict_versions ... ok 175 ms14 > test vault ... ok 46 ms15 > test wal2json ... ok 66 ms16 > test z_17_ext_interface ... ok 156 ms17 > test z_17_intarray_ltree_query ... ok 20 ms18 > test z_17_pg_stat_monitor ... ok 10 ms19 > test z_17_pgvector ... ok 35 ms20 > test z_17_roles ... ok 22 ms21 > test z_17_rum ... ok 30 ms22 >23 > =======================24 > 1 of 68 tests failed.25 > =======================26 >27 > The differences that caused some tests to fail can be viewed in the28 > file "/nix/store/gc0bzr35g1wabsv5jmbbna4jvla5jfrx-run-check-harness-psql-17-slim/regression_output/regression.diffs". A copy of the test summary that you see29 > above is saved in the file "/nix/store/gc0bzr35g1wabsv5jmbbna4jvla5jfrx-run-check-harness-psql-17-slim/regression_output/regression.out".30 >31 > 2026-10-10 14:41:21 [ERROR] pg_regress tests failed32 > 2026-10-10 14:41:21 [ERROR] An error occurred. Exit code: 133 > 2026-10-10 14:41:21 [ERROR] Debug logs:34 For full logs, run:35 nix log /nix/store/1v495sbam57c0x3fxi60bgxb0jhr61h1-run-check-harness-psql-17-slim.drv36error: Cannot build '/nix/store/1v495sbam57c0x3fxi60bgxb0jhr61h1-run-check-harness-psql-17-slim.drv'.37 Reason: builder failed with exit code 1.38 Output paths:39 /nix/store/gc0bzr35g1wabsv5jmbbna4jvla5jfrx-run-check-harness-psql-17-slim