these 2 derivations will be built: /nix/store/gipsy7ckimlxlyx99fp9f415yi8zcpvl-postgres-17-check-harness.drv /nix/store/1v495sbam57c0x3fxi60bgxb0jhr61h1-run-check-harness-psql-17-slim.drv error: build of '/nix/store/1v495sbam57c0x3fxi60bgxb0jhr61h1-run-check-harness-psql-17-slim.drv' on 'ssh-ng://nixbot-remote-build@78.232.36.247' failed: Cannot build '/nix/store/1v495sbam57c0x3fxi60bgxb0jhr61h1-run-check-harness-psql-17-slim.drv'. Reason: builder failed with exit code 1. Output paths: /nix/store/gc0bzr35g1wabsv5jmbbna4jvla5jfrx-run-check-harness-psql-17-slim Last 25 log lines: > test roles ... FAILED 18 ms > test security ... ok 14 ms > test storage ... ok 28 ms > test supautils_reserved_roles ... ok 11 ms > test supautils_restrict_versions ... ok 175 ms > test vault ... ok 46 ms > test wal2json ... ok 66 ms > test z_17_ext_interface ... ok 156 ms > test z_17_intarray_ltree_query ... ok 20 ms > test z_17_pg_stat_monitor ... ok 10 ms > test z_17_pgvector ... ok 35 ms > test z_17_roles ... ok 22 ms > test z_17_rum ... ok 30 ms > > ======================= > 1 of 68 tests failed. > ======================= > > The differences that caused some tests to fail can be viewed in the > file "/nix/store/gc0bzr35g1wabsv5jmbbna4jvla5jfrx-run-check-harness-psql-17-slim/regression_output/regression.diffs". A copy of the test summary that you see > above is saved in the file "/nix/store/gc0bzr35g1wabsv5jmbbna4jvla5jfrx-run-check-harness-psql-17-slim/regression_output/regression.out". > > 2026-10-10 14:41:21 [ERROR] pg_regress tests failed > 2026-10-10 14:41:21 [ERROR] An error occurred. Exit code: 1 > 2026-10-10 14:41:21 [ERROR] Debug logs: For full logs, run: nix log /nix/store/1v495sbam57c0x3fxi60bgxb0jhr61h1-run-check-harness-psql-17-slim.drv error: Cannot build '/nix/store/1v495sbam57c0x3fxi60bgxb0jhr61h1-run-check-harness-psql-17-slim.drv'. Reason: builder failed with exit code 1. Output paths: /nix/store/gc0bzr35g1wabsv5jmbbna4jvla5jfrx-run-check-harness-psql-17-slim