setup
checks.x86_64-linux.psql_17
· build #325
· raw
1this derivation will be built:2 /nix/store/2r2k5pq713s5wi234jmjp5l98537ydv8-run-check-harness-psql-17.drv3these 2 paths will be fetched (23.0 KiB download, 91.0 KiB unpacked):4 /nix/store/six13g4drgqfckf1gpr0xrr7w4i0m1dv-postgres-17-check-harness5 /nix/store/cvm4vy5da9mxk3cajlhyl79m4n616ai1-start-postgres-server-test6error: Cannot build '/nix/store/2r2k5pq713s5wi234jmjp5l98537ydv8-run-check-harness-psql-17.drv'.7 Reason: builder failed with exit code 1.8 Output paths:9 /nix/store/brpkr8gysgrj16zn8n41s4vl768x48k7-run-check-harness-psql-1710 Last 25 log lines:11 > test roles ... FAILED 13 ms12 > test security ... ok 11 ms13 > test storage ... ok 14 ms14 > test supautils_reserved_roles ... ok 9 ms15 > test supautils_restrict_versions ... ok 80 ms16 > test vault ... ok 27 ms17 > test wal2json ... ok 15 ms18 > test z_17_ext_interface ... ok 113 ms19 > test z_17_intarray_ltree_query ... ok 14 ms20 > test z_17_pg_stat_monitor ... ok 10 ms21 > test z_17_pgvector ... ok 13 ms22 > test z_17_roles ... ok 15 ms23 > test z_17_rum ... ok 14 ms24 >25 > =======================26 > 1 of 68 tests failed.27 > =======================28 >29 > The differences that caused some tests to fail can be viewed in the30 > file "/nix/store/brpkr8gysgrj16zn8n41s4vl768x48k7-run-check-harness-psql-17/regression_output/regression.diffs". A copy of the test summary that you see31 > above is saved in the file "/nix/store/brpkr8gysgrj16zn8n41s4vl768x48k7-run-check-harness-psql-17/regression_output/regression.out".32 >33 > 2026-10-10 11:10:52 [ERROR] pg_regress tests failed34 > 2026-10-10 11:10:52 [ERROR] An error occurred. Exit code: 135 > 2026-10-10 11:10:52 [ERROR] Debug logs:36 For full logs, run:37 nix log /nix/store/2r2k5pq713s5wi234jmjp5l98537ydv8-run-check-harness-psql-17.drv