nixbot

builds

supabase/postgres build #325 failed

branch develop · PR #2105 · commit 4a153fd7b1 · · took 1h 38m · eval 2m 31s

12 failed
failed attributes
status attribute duration
failed checks.aarch64-linux.psql_15 1m 28s
run-check-harness-psql-15: 1 of 72 tests failed. ======================= The differences that caused some tests to fail can be viewed in the file "/nix/store/ …
run-check-harness-psql-15:
 1 of 72 tests failed. 
=======================
The differences that caused some tests to fail can be viewed in the
file "/nix/store/pyq7ghgnxn4pc26czwpjx50pi25vxp1l-run-check-harness-psql-15/regression_output/regression.diffs".  A copy of the test summary that you see
above is saved in the file "/nix/store/pyq7ghgnxn4pc26czwpjx50pi25vxp1l-run-check-harness-psql-15/regression_output/regression.out".
2026-10-10 11:07:49 [ERROR] pg_regress tests failed
2026-10-10 11:07:49 [ERROR] An error occurred. Exit code: 1
2026-10-10 11:07:49 [ERROR] Debug logs:
failed checks.aarch64-linux.psql_15_slim 1m 29s
run-check-harness-psql-15-slim: 1 of 72 tests failed. ======================= The differences that caused some tests to fail can be viewed in the file "/nix/s …
run-check-harness-psql-15-slim:
 1 of 72 tests failed. 
=======================
The differences that caused some tests to fail can be viewed in the
file "/nix/store/8q1bpq794ivdwszc49wh92mg3z58x2nh-run-check-harness-psql-15-slim/regression_output/regression.diffs".  A copy of the test summary that you see
above is saved in the file "/nix/store/8q1bpq794ivdwszc49wh92mg3z58x2nh-run-check-harness-psql-15-slim/regression_output/regression.out".
2026-10-10 11:06:25 [ERROR] pg_regress tests failed
2026-10-10 11:06:25 [ERROR] An error occurred. Exit code: 1
2026-10-10 11:06:25 [ERROR] Debug logs:
failed checks.aarch64-linux.psql_17 42s
run-check-harness-psql-17: 1 of 68 tests failed. ======================= The differences that caused some tests to fail can be viewed in the file "/nix/store/ …
run-check-harness-psql-17:
 1 of 68 tests failed. 
=======================
The differences that caused some tests to fail can be viewed in the
file "/nix/store/q0l6ynvzmbn0m83r45w9g9hfniy9vgsb-run-check-harness-psql-17/regression_output/regression.diffs".  A copy of the test summary that you see
above is saved in the file "/nix/store/q0l6ynvzmbn0m83r45w9g9hfniy9vgsb-run-check-harness-psql-17/regression_output/regression.out".
2026-10-10 11:04:11 [ERROR] pg_regress tests failed
2026-10-10 11:04:11 [ERROR] An error occurred. Exit code: 1
2026-10-10 11:04:11 [ERROR] Debug logs:
failed checks.aarch64-linux.psql_17_slim 42s
run-check-harness-psql-17-slim: 1 of 68 tests failed. ======================= The differences that caused some tests to fail can be viewed in the file "/nix/s …
run-check-harness-psql-17-slim:
 1 of 68 tests failed. 
=======================
The differences that caused some tests to fail can be viewed in the
file "/nix/store/z0k9p4w7al1wz4pr0w3fdnlmwysqsnyg-run-check-harness-psql-17-slim/regression_output/regression.diffs".  A copy of the test summary that you see
above is saved in the file "/nix/store/z0k9p4w7al1wz4pr0w3fdnlmwysqsnyg-run-check-harness-psql-17-slim/regression_output/regression.out".
2026-10-10 11:09:01 [ERROR] pg_regress tests failed
2026-10-10 11:09:01 [ERROR] An error occurred. Exit code: 1
2026-10-10 11:09:01 [ERROR] Debug logs:
failed checks.aarch64-linux.psql_orioledb-17 45s
run-check-harness-psql-orioledb-17: 1 of 65 tests failed. ======================= The differences that caused some tests to fail can be viewed in the file "/n …
run-check-harness-psql-orioledb-17:
 1 of 65 tests failed. 
=======================
The differences that caused some tests to fail can be viewed in the
file "/nix/store/zqcrqwjz4y26r6bag9vah7m9y3d7psdw-run-check-harness-psql-orioledb-17/regression_output/regression.diffs".  A copy of the test summary that you see
above is saved in the file "/nix/store/zqcrqwjz4y26r6bag9vah7m9y3d7psdw-run-check-harness-psql-orioledb-17/regression_output/regression.out".
2026-10-10 11:05:18 [ERROR] pg_regress tests failed
2026-10-10 11:05:18 [ERROR] An error occurred. Exit code: 1
2026-10-10 11:05:18 [ERROR] Debug logs:
failed checks.aarch64-linux.psql_orioledb-17_slim 44s
run-check-harness-psql-orioledb-17-slim: 1 of 65 tests failed. ======================= The differences that caused some tests to fail can be viewed in the fil …
run-check-harness-psql-orioledb-17-slim:
 1 of 65 tests failed. 
=======================
The differences that caused some tests to fail can be viewed in the
file "/nix/store/aynixy04w4gaiprd98rfmp5k1ncvrp85-run-check-harness-psql-orioledb-17-slim/regression_output/regression.diffs".  A copy of the test summary that you see
above is saved in the file "/nix/store/aynixy04w4gaiprd98rfmp5k1ncvrp85-run-check-harness-psql-orioledb-17-slim/regression_output/regression.out".
2026-10-10 11:06:09 [ERROR] pg_regress tests failed
2026-10-10 11:06:09 [ERROR] An error occurred. Exit code: 1
2026-10-10 11:06:09 [ERROR] Debug logs:
failed checks.x86_64-linux.psql_15 59s
run-check-harness-psql-15: 1 of 72 tests failed. ======================= The differences that caused some tests to fail can be viewed in the file "/nix/store/ …
run-check-harness-psql-15:
 1 of 72 tests failed. 
=======================
The differences that caused some tests to fail can be viewed in the
file "/nix/store/smz60l5h3ywag7isg0n29w20d9h1w11d-run-check-harness-psql-15/regression_output/regression.diffs".  A copy of the test summary that you see
above is saved in the file "/nix/store/smz60l5h3ywag7isg0n29w20d9h1w11d-run-check-harness-psql-15/regression_output/regression.out".
2026-10-10 11:10:37 [ERROR] pg_regress tests failed
2026-10-10 11:10:37 [ERROR] An error occurred. Exit code: 1
2026-10-10 11:10:37 [ERROR] Debug logs:
failed checks.x86_64-linux.psql_15_slim 1m 1s
run-check-harness-psql-15-slim: 1 of 72 tests failed. ======================= The differences that caused some tests to fail can be viewed in the file "/nix/s …
run-check-harness-psql-15-slim:
 1 of 72 tests failed. 
=======================
The differences that caused some tests to fail can be viewed in the
file "/nix/store/69aiv719w2cmqr26g08n721pxkjzy393-run-check-harness-psql-15-slim/regression_output/regression.diffs".  A copy of the test summary that you see
above is saved in the file "/nix/store/69aiv719w2cmqr26g08n721pxkjzy393-run-check-harness-psql-15-slim/regression_output/regression.out".
2026-10-10 11:10:39 [ERROR] pg_regress tests failed
2026-10-10 11:10:39 [ERROR] An error occurred. Exit code: 1
2026-10-10 11:10:39 [ERROR] Debug logs:
failed checks.x86_64-linux.psql_17 31s
run-check-harness-psql-17: 1 of 68 tests failed. ======================= The differences that caused some tests to fail can be viewed in the file "/nix/store/ …
run-check-harness-psql-17:
 1 of 68 tests failed. 
=======================
The differences that caused some tests to fail can be viewed in the
file "/nix/store/brpkr8gysgrj16zn8n41s4vl768x48k7-run-check-harness-psql-17/regression_output/regression.diffs".  A copy of the test summary that you see
above is saved in the file "/nix/store/brpkr8gysgrj16zn8n41s4vl768x48k7-run-check-harness-psql-17/regression_output/regression.out".
2026-10-10 11:10:52 [ERROR] pg_regress tests failed
2026-10-10 11:10:52 [ERROR] An error occurred. Exit code: 1
2026-10-10 11:10:52 [ERROR] Debug logs:
failed checks.x86_64-linux.psql_17_slim 32s
run-check-harness-psql-17-slim: 1 of 68 tests failed. ======================= The differences that caused some tests to fail can be viewed in the file "/nix/s …
run-check-harness-psql-17-slim:
 1 of 68 tests failed. 
=======================
The differences that caused some tests to fail can be viewed in the
file "/nix/store/ia2lnl7ylvaga9lrwgjwsfshzr7vri7z-run-check-harness-psql-17-slim/regression_output/regression.diffs".  A copy of the test summary that you see
above is saved in the file "/nix/store/ia2lnl7ylvaga9lrwgjwsfshzr7vri7z-run-check-harness-psql-17-slim/regression_output/regression.out".
2026-10-10 11:10:12 [ERROR] pg_regress tests failed
2026-10-10 11:10:12 [ERROR] An error occurred. Exit code: 1
2026-10-10 11:10:12 [ERROR] Debug logs:
failed checks.x86_64-linux.psql_orioledb-17 32s
run-check-harness-psql-orioledb-17: 1 of 65 tests failed. ======================= The differences that caused some tests to fail can be viewed in the file "/n …
run-check-harness-psql-orioledb-17:
 1 of 65 tests failed. 
=======================
The differences that caused some tests to fail can be viewed in the
file "/nix/store/765763l4rrvcdm26pzlf6na3l4w0mkxq-run-check-harness-psql-orioledb-17/regression_output/regression.diffs".  A copy of the test summary that you see
above is saved in the file "/nix/store/765763l4rrvcdm26pzlf6na3l4w0mkxq-run-check-harness-psql-orioledb-17/regression_output/regression.out".
2026-10-10 11:10:11 [ERROR] pg_regress tests failed
2026-10-10 11:10:11 [ERROR] An error occurred. Exit code: 1
2026-10-10 11:10:11 [ERROR] Debug logs:
failed checks.x86_64-linux.psql_orioledb-17_slim 32s
run-check-harness-psql-orioledb-17-slim: 1 of 65 tests failed. ======================= The differences that caused some tests to fail can be viewed in the fil …
run-check-harness-psql-orioledb-17-slim:
 1 of 65 tests failed. 
=======================
The differences that caused some tests to fail can be viewed in the
file "/nix/store/znnz3g471sij5v3zbixr8hpm81d0s15i-run-check-harness-psql-orioledb-17-slim/regression_output/regression.diffs".  A copy of the test summary that you see
above is saved in the file "/nix/store/znnz3g471sij5v3zbixr8hpm81d0s15i-run-check-harness-psql-orioledb-17-slim/regression_output/regression.out".
2026-10-10 11:10:29 [ERROR] pg_regress tests failed
2026-10-10 11:10:29 [ERROR] An error occurred. Exit code: 1
2026-10-10 11:10:29 [ERROR] Debug logs:
72 succeeded
succeeded attributes
status attribute duration
loading…
38 already built
skipped attributes
status attribute duration
loading…