this derivation will be built: /nix/store/2r2k5pq713s5wi234jmjp5l98537ydv8-run-check-harness-psql-17.drv these 2 paths will be fetched (23.0 KiB download, 91.0 KiB unpacked): /nix/store/six13g4drgqfckf1gpr0xrr7w4i0m1dv-postgres-17-check-harness /nix/store/cvm4vy5da9mxk3cajlhyl79m4n616ai1-start-postgres-server-test error: Cannot build '/nix/store/2r2k5pq713s5wi234jmjp5l98537ydv8-run-check-harness-psql-17.drv'. Reason: builder failed with exit code 1. Output paths: /nix/store/brpkr8gysgrj16zn8n41s4vl768x48k7-run-check-harness-psql-17 Last 25 log lines: > test roles ... FAILED 13 ms > test security ... ok 11 ms > test storage ... ok 14 ms > test supautils_reserved_roles ... ok 9 ms > test supautils_restrict_versions ... ok 80 ms > test vault ... ok 27 ms > test wal2json ... ok 15 ms > test z_17_ext_interface ... ok 113 ms > test z_17_intarray_ltree_query ... ok 14 ms > test z_17_pg_stat_monitor ... ok 10 ms > test z_17_pgvector ... ok 13 ms > test z_17_roles ... ok 15 ms > test z_17_rum ... ok 14 ms > > ======================= > 1 of 68 tests failed. > ======================= > > The differences that caused some tests to fail can be viewed in the > file "/nix/store/brpkr8gysgrj16zn8n41s4vl768x48k7-run-check-harness-psql-17/regression_output/regression.diffs". A copy of the test summary that you see > above is saved in the file "/nix/store/brpkr8gysgrj16zn8n41s4vl768x48k7-run-check-harness-psql-17/regression_output/regression.out". > > 2026-10-10 11:10:52 [ERROR] pg_regress tests failed > 2026-10-10 11:10:52 [ERROR] An error occurred. Exit code: 1 > 2026-10-10 11:10:52 [ERROR] Debug logs: For full logs, run: nix log /nix/store/2r2k5pq713s5wi234jmjp5l98537ydv8-run-check-harness-psql-17.drv