setup
checks.x86_64-linux.psql_15_slim
· build #325
· raw
1this derivation will be built:2 /nix/store/0xkdpg8vnzsxn9sh8lip61vr9bf9c1rx-run-check-harness-psql-15-slim.drv3these 2 paths will be fetched (23.0 KiB download, 91.1 KiB unpacked):4 /nix/store/f9zn39n9a37b7fpgcflbsji5chxbqhff-postgres-15-check-harness5 /nix/store/msmqwkcjckm0i702sqkqj2rv78jf8cky-start-postgres-server-test6error: Cannot build '/nix/store/0xkdpg8vnzsxn9sh8lip61vr9bf9c1rx-run-check-harness-psql-15-slim.drv'.7 Reason: builder failed with exit code 1.8 Output paths:9 /nix/store/69aiv719w2cmqr26g08n721pxkjzy393-run-check-harness-psql-15-slim10 Last 25 log lines:11 > test supautils_restrict_versions ... ok 82 ms12 > test vault ... ok 27 ms13 > test wal2json ... ok 13 ms14 > test z_15_ext_interface ... ok 621 ms15 > test z_15_intarray_ltree_query ... ok 11 ms16 > test z_15_pg_stat_monitor ... ok 12 ms17 > test z_15_pgjwt ... ok 17 ms18 > test z_15_pgvector ... ok 31 ms19 > test z_15_plv8 ... ok 48 ms20 > test z_15_roles ... ok 17 ms21 > test z_15_rum ... ok 18 ms22 > test z_15_timescale ... ok 21 ms23 > test z_15_unhype_timescale_to_partman ... ok 11738 ms24 >25 > =======================26 > 1 of 72 tests failed.27 > =======================28 >29 > The differences that caused some tests to fail can be viewed in the30 > file "/nix/store/69aiv719w2cmqr26g08n721pxkjzy393-run-check-harness-psql-15-slim/regression_output/regression.diffs". A copy of the test summary that you see31 > above is saved in the file "/nix/store/69aiv719w2cmqr26g08n721pxkjzy393-run-check-harness-psql-15-slim/regression_output/regression.out".32 >33 > 2026-10-10 11:10:39 [ERROR] pg_regress tests failed34 > 2026-10-10 11:10:39 [ERROR] An error occurred. Exit code: 135 > 2026-10-10 11:10:39 [ERROR] Debug logs:36 For full logs, run:37 nix log /nix/store/0xkdpg8vnzsxn9sh8lip61vr9bf9c1rx-run-check-harness-psql-15-slim.drv