this derivation will be built: /nix/store/0xkdpg8vnzsxn9sh8lip61vr9bf9c1rx-run-check-harness-psql-15-slim.drv these 2 paths will be fetched (23.0 KiB download, 91.1 KiB unpacked): /nix/store/f9zn39n9a37b7fpgcflbsji5chxbqhff-postgres-15-check-harness /nix/store/msmqwkcjckm0i702sqkqj2rv78jf8cky-start-postgres-server-test error: Cannot build '/nix/store/0xkdpg8vnzsxn9sh8lip61vr9bf9c1rx-run-check-harness-psql-15-slim.drv'. Reason: builder failed with exit code 1. Output paths: /nix/store/69aiv719w2cmqr26g08n721pxkjzy393-run-check-harness-psql-15-slim Last 25 log lines: > test supautils_restrict_versions ... ok 82 ms > test vault ... ok 27 ms > test wal2json ... ok 13 ms > test z_15_ext_interface ... ok 621 ms > test z_15_intarray_ltree_query ... ok 11 ms > test z_15_pg_stat_monitor ... ok 12 ms > test z_15_pgjwt ... ok 17 ms > test z_15_pgvector ... ok 31 ms > test z_15_plv8 ... ok 48 ms > test z_15_roles ... ok 17 ms > test z_15_rum ... ok 18 ms > test z_15_timescale ... ok 21 ms > test z_15_unhype_timescale_to_partman ... ok 11738 ms > > ======================= > 1 of 72 tests failed. > ======================= > > The differences that caused some tests to fail can be viewed in the > file "/nix/store/69aiv719w2cmqr26g08n721pxkjzy393-run-check-harness-psql-15-slim/regression_output/regression.diffs". A copy of the test summary that you see > above is saved in the file "/nix/store/69aiv719w2cmqr26g08n721pxkjzy393-run-check-harness-psql-15-slim/regression_output/regression.out". > > 2026-10-10 11:10:39 [ERROR] pg_regress tests failed > 2026-10-10 11:10:39 [ERROR] An error occurred. Exit code: 1 > 2026-10-10 11:10:39 [ERROR] Debug logs: For full logs, run: nix log /nix/store/0xkdpg8vnzsxn9sh8lip61vr9bf9c1rx-run-check-harness-psql-15-slim.drv