setup
checks.x86_64-linux.psql_15
· build #173
· raw
1this derivation will be built:2 /nix/store/2s1laq2zy1lha81731nfcn373ladwbmk-run-check-harness-psql-15.drv3error: Cannot build '/nix/store/2s1laq2zy1lha81731nfcn373ladwbmk-run-check-harness-psql-15.drv'.4 Reason: builder failed with exit code 1.5 Output paths:6 /nix/store/zj94ir5hxqavk9fqwwzf783zmf19ad43-run-check-harness-psql-157 Last 25 log lines:8 > test supautils_restrict_versions ... ok 86 ms9 > test vault ... ok 31 ms10 > test wal2json ... ok 15 ms11 > test z_15_ext_interface ... FAILED 691 ms12 > test z_15_intarray_ltree_query ... ok 11 ms13 > test z_15_pg_stat_monitor ... ok 11 ms14 > test z_15_pgjwt ... ok 19 ms15 > test z_15_pgvector ... ok 34 ms16 > test z_15_plv8 ... ok 60 ms17 > test z_15_roles ... ok 20 ms18 > test z_15_rum ... ok 24 ms19 > test z_15_timescale ... ok 34 ms20 > test z_15_unhype_timescale_to_partman ... ok 15713 ms21 >22 > =======================23 > 2 of 72 tests failed.24 > =======================25 >26 > The differences that caused some tests to fail can be viewed in the27 > file "/nix/store/zj94ir5hxqavk9fqwwzf783zmf19ad43-run-check-harness-psql-15/regression_output/regression.diffs". A copy of the test summary that you see28 > above is saved in the file "/nix/store/zj94ir5hxqavk9fqwwzf783zmf19ad43-run-check-harness-psql-15/regression_output/regression.out".29 >30 > 2026-10-08 01:10:33 [ERROR] pg_regress tests failed31 > 2026-10-08 01:10:33 [ERROR] An error occurred. Exit code: 132 > 2026-10-08 01:10:33 [ERROR] Debug logs:33 For full logs, run:34 nix log /nix/store/2s1laq2zy1lha81731nfcn373ladwbmk-run-check-harness-psql-15.drv