nixbot

builds

supabase/postgres build #173 failed

branch develop · PR #2521 · commit 4e3ee06185 · · took 1h 40m · eval 1m 37s

12 failed
failed attributes
status attribute duration
failed checks.aarch64-linux.psql_15 1m 26s
run-check-harness-psql-15: 2 of 72 tests failed. ======================= The differences that caused some tests to fail can be viewed in the file "/nix/store/ …
run-check-harness-psql-15:
 2 of 72 tests failed. 
=======================
The differences that caused some tests to fail can be viewed in the
file "/nix/store/d3qals27z1jpqym6bncj6mjk58svksp0-run-check-harness-psql-15/regression_output/regression.diffs".  A copy of the test summary that you see
above is saved in the file "/nix/store/d3qals27z1jpqym6bncj6mjk58svksp0-run-check-harness-psql-15/regression_output/regression.out".
2026-10-08 00:55:25 [ERROR] pg_regress tests failed
2026-10-08 00:55:25 [ERROR] An error occurred. Exit code: 1
2026-10-08 00:55:25 [ERROR] Debug logs:
failed checks.aarch64-linux.psql_15_slim 1m 27s
run-check-harness-psql-15-slim: 2 of 72 tests failed. ======================= The differences that caused some tests to fail can be viewed in the file "/nix/s …
run-check-harness-psql-15-slim:
 2 of 72 tests failed. 
=======================
The differences that caused some tests to fail can be viewed in the
file "/nix/store/qaj1y9igskwfvxr7k0a0dm0iwh81bswn-run-check-harness-psql-15-slim/regression_output/regression.diffs".  A copy of the test summary that you see
above is saved in the file "/nix/store/qaj1y9igskwfvxr7k0a0dm0iwh81bswn-run-check-harness-psql-15-slim/regression_output/regression.out".
2026-10-08 00:59:19 [ERROR] pg_regress tests failed
2026-10-08 00:59:19 [ERROR] An error occurred. Exit code: 1
2026-10-08 00:59:19 [ERROR] Debug logs:
failed checks.aarch64-linux.psql_17 41s
run-check-harness-psql-17: 2 of 68 tests failed. ======================= The differences that caused some tests to fail can be viewed in the file "/nix/store/ …
run-check-harness-psql-17:
 2 of 68 tests failed. 
=======================
The differences that caused some tests to fail can be viewed in the
file "/nix/store/4ynvg2fi6iiaz4csllbb19vqkvk8w3zs-run-check-harness-psql-17/regression_output/regression.diffs".  A copy of the test summary that you see
above is saved in the file "/nix/store/4ynvg2fi6iiaz4csllbb19vqkvk8w3zs-run-check-harness-psql-17/regression_output/regression.out".
2026-10-08 01:02:26 [ERROR] pg_regress tests failed
2026-10-08 01:02:26 [ERROR] An error occurred. Exit code: 1
2026-10-08 01:02:26 [ERROR] Debug logs:
failed checks.aarch64-linux.psql_17_slim 42s
run-check-harness-psql-17-slim: 2 of 68 tests failed. ======================= The differences that caused some tests to fail can be viewed in the file "/nix/s …
run-check-harness-psql-17-slim:
 2 of 68 tests failed. 
=======================
The differences that caused some tests to fail can be viewed in the
file "/nix/store/ccgkcvzzdvg5wbs6srlbhglyb7f07cl5-run-check-harness-psql-17-slim/regression_output/regression.diffs".  A copy of the test summary that you see
above is saved in the file "/nix/store/ccgkcvzzdvg5wbs6srlbhglyb7f07cl5-run-check-harness-psql-17-slim/regression_output/regression.out".
2026-10-08 01:01:00 [ERROR] pg_regress tests failed
2026-10-08 01:01:00 [ERROR] An error occurred. Exit code: 1
2026-10-08 01:01:00 [ERROR] Debug logs:
failed checks.aarch64-linux.psql_orioledb-17 44s
run-check-harness-psql-orioledb-17: 2 of 65 tests failed. ======================= The differences that caused some tests to fail can be viewed in the file "/n …
run-check-harness-psql-orioledb-17:
 2 of 65 tests failed. 
=======================
The differences that caused some tests to fail can be viewed in the
file "/nix/store/cgrhr8pgz0nbhwmfn1l5arv2n906r4lh-run-check-harness-psql-orioledb-17/regression_output/regression.diffs".  A copy of the test summary that you see
above is saved in the file "/nix/store/cgrhr8pgz0nbhwmfn1l5arv2n906r4lh-run-check-harness-psql-orioledb-17/regression_output/regression.out".
2026-10-08 00:59:28 [ERROR] pg_regress tests failed
2026-10-08 00:59:28 [ERROR] An error occurred. Exit code: 1
2026-10-08 00:59:28 [ERROR] Debug logs:
failed checks.aarch64-linux.psql_orioledb-17_slim 43s
run-check-harness-psql-orioledb-17-slim: 2 of 65 tests failed. ======================= The differences that caused some tests to fail can be viewed in the fil …
run-check-harness-psql-orioledb-17-slim:
 2 of 65 tests failed. 
=======================
The differences that caused some tests to fail can be viewed in the
file "/nix/store/3anqbh74cs398zlddjakmc18q5q9ljk7-run-check-harness-psql-orioledb-17-slim/regression_output/regression.diffs".  A copy of the test summary that you see
above is saved in the file "/nix/store/3anqbh74cs398zlddjakmc18q5q9ljk7-run-check-harness-psql-orioledb-17-slim/regression_output/regression.out".
2026-10-08 01:01:44 [ERROR] pg_regress tests failed
2026-10-08 01:01:44 [ERROR] An error occurred. Exit code: 1
2026-10-08 01:01:44 [ERROR] Debug logs:
failed checks.x86_64-linux.psql_15 1m 11s
run-check-harness-psql-15: 2 of 72 tests failed. ======================= The differences that caused some tests to fail can be viewed in the file "/nix/store/ …
run-check-harness-psql-15:
 2 of 72 tests failed. 
=======================
The differences that caused some tests to fail can be viewed in the
file "/nix/store/zj94ir5hxqavk9fqwwzf783zmf19ad43-run-check-harness-psql-15/regression_output/regression.diffs".  A copy of the test summary that you see
above is saved in the file "/nix/store/zj94ir5hxqavk9fqwwzf783zmf19ad43-run-check-harness-psql-15/regression_output/regression.out".
2026-10-08 01:10:33 [ERROR] pg_regress tests failed
2026-10-08 01:10:33 [ERROR] An error occurred. Exit code: 1
2026-10-08 01:10:33 [ERROR] Debug logs:
failed checks.x86_64-linux.psql_15_slim 1m 6s
run-check-harness-psql-15-slim: 2 of 72 tests failed. ======================= The differences that caused some tests to fail can be viewed in the file "/nix/s …
run-check-harness-psql-15-slim:
 2 of 72 tests failed. 
=======================
The differences that caused some tests to fail can be viewed in the
file "/nix/store/vi8a4kjhgscr0bg0d8jn7bjp47c36cg0-run-check-harness-psql-15-slim/regression_output/regression.diffs".  A copy of the test summary that you see
above is saved in the file "/nix/store/vi8a4kjhgscr0bg0d8jn7bjp47c36cg0-run-check-harness-psql-15-slim/regression_output/regression.out".
2026-10-08 01:08:14 [ERROR] pg_regress tests failed
2026-10-08 01:08:14 [ERROR] An error occurred. Exit code: 1
2026-10-08 01:08:14 [ERROR] Debug logs:
failed checks.x86_64-linux.psql_17 36s
run-check-harness-psql-17: 2 of 68 tests failed. ======================= The differences that caused some tests to fail can be viewed in the file "/nix/store/ …
run-check-harness-psql-17:
 2 of 68 tests failed. 
=======================
The differences that caused some tests to fail can be viewed in the
file "/nix/store/460qcgn7a52x3lvgg94hkd6bsf5r8xzm-run-check-harness-psql-17/regression_output/regression.diffs".  A copy of the test summary that you see
above is saved in the file "/nix/store/460qcgn7a52x3lvgg94hkd6bsf5r8xzm-run-check-harness-psql-17/regression_output/regression.out".
2026-10-08 01:10:25 [ERROR] pg_regress tests failed
2026-10-08 01:10:25 [ERROR] An error occurred. Exit code: 1
2026-10-08 01:10:25 [ERROR] Debug logs:
failed checks.x86_64-linux.psql_17_slim 35s
run-check-harness-psql-17-slim: 2 of 68 tests failed. ======================= The differences that caused some tests to fail can be viewed in the file "/nix/s …
run-check-harness-psql-17-slim:
 2 of 68 tests failed. 
=======================
The differences that caused some tests to fail can be viewed in the
file "/nix/store/nhm3mc0krbp2b04fsjvh7593pafw0pr5-run-check-harness-psql-17-slim/regression_output/regression.diffs".  A copy of the test summary that you see
above is saved in the file "/nix/store/nhm3mc0krbp2b04fsjvh7593pafw0pr5-run-check-harness-psql-17-slim/regression_output/regression.out".
2026-10-08 01:08:15 [ERROR] pg_regress tests failed
2026-10-08 01:08:15 [ERROR] An error occurred. Exit code: 1
2026-10-08 01:08:15 [ERROR] Debug logs:
failed checks.x86_64-linux.psql_orioledb-17 35s
run-check-harness-psql-orioledb-17: 2 of 65 tests failed. ======================= The differences that caused some tests to fail can be viewed in the file "/n …
run-check-harness-psql-orioledb-17:
 2 of 65 tests failed. 
=======================
The differences that caused some tests to fail can be viewed in the
file "/nix/store/ihwmsy2la6yar4njn54b6c32kay953aa-run-check-harness-psql-orioledb-17/regression_output/regression.diffs".  A copy of the test summary that you see
above is saved in the file "/nix/store/ihwmsy2la6yar4njn54b6c32kay953aa-run-check-harness-psql-orioledb-17/regression_output/regression.out".
2026-10-08 01:08:45 [ERROR] pg_regress tests failed
2026-10-08 01:08:45 [ERROR] An error occurred. Exit code: 1
2026-10-08 01:08:45 [ERROR] Debug logs:
failed checks.x86_64-linux.psql_orioledb-17_slim 35s
run-check-harness-psql-orioledb-17-slim: 2 of 65 tests failed. ======================= The differences that caused some tests to fail can be viewed in the fil …
run-check-harness-psql-orioledb-17-slim:
 2 of 65 tests failed. 
=======================
The differences that caused some tests to fail can be viewed in the
file "/nix/store/1dskgff1dxxn40x3wpkkg6cb6kxkwwz9-run-check-harness-psql-orioledb-17-slim/regression_output/regression.diffs".  A copy of the test summary that you see
above is saved in the file "/nix/store/1dskgff1dxxn40x3wpkkg6cb6kxkwwz9-run-check-harness-psql-orioledb-17-slim/regression_output/regression.out".
2026-10-08 01:08:50 [ERROR] pg_regress tests failed
2026-10-08 01:08:50 [ERROR] An error occurred. Exit code: 1
2026-10-08 01:08:50 [ERROR] Debug logs:
42 succeeded
succeeded attributes
status attribute duration
loading…
70 already built
skipped attributes
status attribute duration
loading…