failed attributes
| status |
attribute |
duration |
| failed |
checks.aarch64-linux.psql_15
|
1m 31s |
run-check-harness-psql-15:
2 of 72 tests failed.
=======================
The differences that caused some tests to fail can be viewed in the
file "/nix/store/ …
run-check-harness-psql-15:
2 of 72 tests failed.
=======================
The differences that caused some tests to fail can be viewed in the
file "/nix/store/2nq3ad7hsx3i9zda7cismjf21x77msp1-run-check-harness-psql-15/regression_output/regression.diffs". A copy of the test summary that you see
above is saved in the file "/nix/store/2nq3ad7hsx3i9zda7cismjf21x77msp1-run-check-harness-psql-15/regression_output/regression.out".
2026-10-08 01:00:18 [ERROR] pg_regress tests failed
2026-10-08 01:00:18 [ERROR] An error occurred. Exit code: 1
2026-10-08 01:00:18 [ERROR] Debug logs:
|
| failed |
checks.aarch64-linux.psql_15_slim
|
1m 31s |
run-check-harness-psql-15-slim:
2 of 72 tests failed.
=======================
The differences that caused some tests to fail can be viewed in the
file "/nix/s …
run-check-harness-psql-15-slim:
2 of 72 tests failed.
=======================
The differences that caused some tests to fail can be viewed in the
file "/nix/store/7028k2i8zm89d5fmmcrsm3k4l3lydvl9-run-check-harness-psql-15-slim/regression_output/regression.diffs". A copy of the test summary that you see
above is saved in the file "/nix/store/7028k2i8zm89d5fmmcrsm3k4l3lydvl9-run-check-harness-psql-15-slim/regression_output/regression.out".
2026-10-08 01:05:24 [ERROR] pg_regress tests failed
2026-10-08 01:05:24 [ERROR] An error occurred. Exit code: 1
2026-10-08 01:05:24 [ERROR] Debug logs:
|
| failed |
checks.aarch64-linux.psql_17
|
44s |
run-check-harness-psql-17:
2 of 68 tests failed.
=======================
The differences that caused some tests to fail can be viewed in the
file "/nix/store/ …
run-check-harness-psql-17:
2 of 68 tests failed.
=======================
The differences that caused some tests to fail can be viewed in the
file "/nix/store/1xq0l4wpyys9v7hlv9bdgqwg4m71xc5x-run-check-harness-psql-17/regression_output/regression.diffs". A copy of the test summary that you see
above is saved in the file "/nix/store/1xq0l4wpyys9v7hlv9bdgqwg4m71xc5x-run-check-harness-psql-17/regression_output/regression.out".
2026-10-08 01:05:52 [ERROR] pg_regress tests failed
2026-10-08 01:05:52 [ERROR] An error occurred. Exit code: 1
2026-10-08 01:05:52 [ERROR] Debug logs:
|
| failed |
checks.aarch64-linux.psql_17_slim
|
44s |
run-check-harness-psql-17-slim:
2 of 68 tests failed.
=======================
The differences that caused some tests to fail can be viewed in the
file "/nix/s …
run-check-harness-psql-17-slim:
2 of 68 tests failed.
=======================
The differences that caused some tests to fail can be viewed in the
file "/nix/store/ghpl1yrrfnwxqjamiwpbb7i5b5lr1v7c-run-check-harness-psql-17-slim/regression_output/regression.diffs". A copy of the test summary that you see
above is saved in the file "/nix/store/ghpl1yrrfnwxqjamiwpbb7i5b5lr1v7c-run-check-harness-psql-17-slim/regression_output/regression.out".
2026-10-08 01:00:18 [ERROR] pg_regress tests failed
2026-10-08 01:00:18 [ERROR] An error occurred. Exit code: 1
2026-10-08 01:00:18 [ERROR] Debug logs:
|
| failed |
checks.aarch64-linux.psql_orioledb-17
|
46s |
run-check-harness-psql-orioledb-17:
2 of 65 tests failed.
=======================
The differences that caused some tests to fail can be viewed in the
file "/n …
run-check-harness-psql-orioledb-17:
2 of 65 tests failed.
=======================
The differences that caused some tests to fail can be viewed in the
file "/nix/store/asxp97jq8sf2s2ma6xsr5ygbwxy56qlh-run-check-harness-psql-orioledb-17/regression_output/regression.diffs". A copy of the test summary that you see
above is saved in the file "/nix/store/asxp97jq8sf2s2ma6xsr5ygbwxy56qlh-run-check-harness-psql-orioledb-17/regression_output/regression.out".
2026-10-08 01:05:07 [ERROR] pg_regress tests failed
2026-10-08 01:05:07 [ERROR] An error occurred. Exit code: 1
2026-10-08 01:05:07 [ERROR] Debug logs:
|
| failed |
checks.aarch64-linux.psql_orioledb-17_slim
|
46s |
run-check-harness-psql-orioledb-17-slim:
2 of 65 tests failed.
=======================
The differences that caused some tests to fail can be viewed in the
fil …
run-check-harness-psql-orioledb-17-slim:
2 of 65 tests failed.
=======================
The differences that caused some tests to fail can be viewed in the
file "/nix/store/sdd7fv87vnkmd5lyp5xqmwi278w0mi33-run-check-harness-psql-orioledb-17-slim/regression_output/regression.diffs". A copy of the test summary that you see
above is saved in the file "/nix/store/sdd7fv87vnkmd5lyp5xqmwi278w0mi33-run-check-harness-psql-orioledb-17-slim/regression_output/regression.out".
2026-10-08 01:01:05 [ERROR] pg_regress tests failed
2026-10-08 01:01:05 [ERROR] An error occurred. Exit code: 1
2026-10-08 01:01:05 [ERROR] Debug logs:
|
| failed |
checks.x86_64-linux.psql_15
|
1m 11s |
run-check-harness-psql-15:
2 of 72 tests failed.
=======================
The differences that caused some tests to fail can be viewed in the
file "/nix/store/ …
run-check-harness-psql-15:
2 of 72 tests failed.
=======================
The differences that caused some tests to fail can be viewed in the
file "/nix/store/bm74vfhy2zg4ayfy7y8i6v2z87nzs8wi-run-check-harness-psql-15/regression_output/regression.diffs". A copy of the test summary that you see
above is saved in the file "/nix/store/bm74vfhy2zg4ayfy7y8i6v2z87nzs8wi-run-check-harness-psql-15/regression_output/regression.out".
2026-10-08 01:11:04 [ERROR] pg_regress tests failed
2026-10-08 01:11:04 [ERROR] An error occurred. Exit code: 1
2026-10-08 01:11:04 [ERROR] Debug logs:
|
| failed |
checks.x86_64-linux.psql_15_slim
|
1m 4s |
run-check-harness-psql-15-slim:
2 of 72 tests failed.
=======================
The differences that caused some tests to fail can be viewed in the
file "/nix/s …
run-check-harness-psql-15-slim:
2 of 72 tests failed.
=======================
The differences that caused some tests to fail can be viewed in the
file "/nix/store/dbld50dc4jhix6aha28kvqvxfkjrh3in-run-check-harness-psql-15-slim/regression_output/regression.diffs". A copy of the test summary that you see
above is saved in the file "/nix/store/dbld50dc4jhix6aha28kvqvxfkjrh3in-run-check-harness-psql-15-slim/regression_output/regression.out".
2026-10-08 01:11:40 [ERROR] pg_regress tests failed
2026-10-08 01:11:40 [ERROR] An error occurred. Exit code: 1
2026-10-08 01:11:40 [ERROR] Debug logs:
|
| failed |
checks.x86_64-linux.psql_17
|
38s |
run-check-harness-psql-17:
2 of 68 tests failed.
=======================
The differences that caused some tests to fail can be viewed in the
file "/nix/store/ …
run-check-harness-psql-17:
2 of 68 tests failed.
=======================
The differences that caused some tests to fail can be viewed in the
file "/nix/store/iya40r4az8pn1k7mx9x142xyb4dbpi5g-run-check-harness-psql-17/regression_output/regression.diffs". A copy of the test summary that you see
above is saved in the file "/nix/store/iya40r4az8pn1k7mx9x142xyb4dbpi5g-run-check-harness-psql-17/regression_output/regression.out".
2026-10-08 01:10:33 [ERROR] pg_regress tests failed
2026-10-08 01:10:33 [ERROR] An error occurred. Exit code: 1
2026-10-08 01:10:33 [ERROR] Debug logs:
|
| failed |
checks.x86_64-linux.psql_17_slim
|
34s |
run-check-harness-psql-17-slim:
2 of 68 tests failed.
=======================
The differences that caused some tests to fail can be viewed in the
file "/nix/s …
run-check-harness-psql-17-slim:
2 of 68 tests failed.
=======================
The differences that caused some tests to fail can be viewed in the
file "/nix/store/p2xkl4v76a8s67nvhdmydxvdii0zc550-run-check-harness-psql-17-slim/regression_output/regression.diffs". A copy of the test summary that you see
above is saved in the file "/nix/store/p2xkl4v76a8s67nvhdmydxvdii0zc550-run-check-harness-psql-17-slim/regression_output/regression.out".
2026-10-08 01:11:05 [ERROR] pg_regress tests failed
2026-10-08 01:11:05 [ERROR] An error occurred. Exit code: 1
2026-10-08 01:11:05 [ERROR] Debug logs:
|
| failed |
checks.x86_64-linux.psql_orioledb-17
|
34s |
run-check-harness-psql-orioledb-17:
2 of 65 tests failed.
=======================
The differences that caused some tests to fail can be viewed in the
file "/n …
run-check-harness-psql-orioledb-17:
2 of 65 tests failed.
=======================
The differences that caused some tests to fail can be viewed in the
file "/nix/store/2d1mng6hp6zkpjpmnp4fvp7d1wmzy6kg-run-check-harness-psql-orioledb-17/regression_output/regression.diffs". A copy of the test summary that you see
above is saved in the file "/nix/store/2d1mng6hp6zkpjpmnp4fvp7d1wmzy6kg-run-check-harness-psql-orioledb-17/regression_output/regression.out".
2026-10-08 01:11:11 [ERROR] pg_regress tests failed
2026-10-08 01:11:11 [ERROR] An error occurred. Exit code: 1
2026-10-08 01:11:11 [ERROR] Debug logs:
|
| failed |
checks.x86_64-linux.psql_orioledb-17_slim
|
33s |
run-check-harness-psql-orioledb-17-slim:
2 of 65 tests failed.
=======================
The differences that caused some tests to fail can be viewed in the
fil …
run-check-harness-psql-orioledb-17-slim:
2 of 65 tests failed.
=======================
The differences that caused some tests to fail can be viewed in the
file "/nix/store/92c6hldl51n4b9cy784i23wrykvp18cx-run-check-harness-psql-orioledb-17-slim/regression_output/regression.diffs". A copy of the test summary that you see
above is saved in the file "/nix/store/92c6hldl51n4b9cy784i23wrykvp18cx-run-check-harness-psql-orioledb-17-slim/regression_output/regression.out".
2026-10-08 01:11:11 [ERROR] pg_regress tests failed
2026-10-08 01:11:11 [ERROR] An error occurred. Exit code: 1
2026-10-08 01:11:11 [ERROR] Debug logs:
|