this derivation will be built: /nix/store/2s1laq2zy1lha81731nfcn373ladwbmk-run-check-harness-psql-15.drv error: Cannot build '/nix/store/2s1laq2zy1lha81731nfcn373ladwbmk-run-check-harness-psql-15.drv'. Reason: builder failed with exit code 1. Output paths: /nix/store/zj94ir5hxqavk9fqwwzf783zmf19ad43-run-check-harness-psql-15 Last 25 log lines: > test supautils_restrict_versions ... ok 86 ms > test vault ... ok 31 ms > test wal2json ... ok 15 ms > test z_15_ext_interface ... FAILED 691 ms > test z_15_intarray_ltree_query ... ok 11 ms > test z_15_pg_stat_monitor ... ok 11 ms > test z_15_pgjwt ... ok 19 ms > test z_15_pgvector ... ok 34 ms > test z_15_plv8 ... ok 60 ms > test z_15_roles ... ok 20 ms > test z_15_rum ... ok 24 ms > test z_15_timescale ... ok 34 ms > test z_15_unhype_timescale_to_partman ... ok 15713 ms > > ======================= > 2 of 72 tests failed. > ======================= > > The differences that caused some tests to fail can be viewed in the > file "/nix/store/zj94ir5hxqavk9fqwwzf783zmf19ad43-run-check-harness-psql-15/regression_output/regression.diffs". A copy of the test summary that you see > above is saved in the file "/nix/store/zj94ir5hxqavk9fqwwzf783zmf19ad43-run-check-harness-psql-15/regression_output/regression.out". > > 2026-10-08 01:10:33 [ERROR] pg_regress tests failed > 2026-10-08 01:10:33 [ERROR] An error occurred. Exit code: 1 > 2026-10-08 01:10:33 [ERROR] Debug logs: For full logs, run: nix log /nix/store/2s1laq2zy1lha81731nfcn373ladwbmk-run-check-harness-psql-15.drv