1this derivation will be built:2 /nix/store/41yx977lp37qm4c932y6hqas0vjz7dvh-run-check-harness-psql-orioledb-17.drv3this path will be fetched (4.5 KiB download, 16.3 KiB unpacked):4 /nix/store/m3yq11l5hkcy0dkarfmvi5ld3lqk7pa6-postgres-orioledb-17-check-harness5error: Cannot build '/nix/store/41yx977lp37qm4c932y6hqas0vjz7dvh-run-check-harness-psql-orioledb-17.drv'.6 Reason: builder failed with exit code 1.7 Output paths:8 /nix/store/2d1mng6hp6zkpjpmnp4fvp7d1wmzy6kg-run-check-harness-psql-orioledb-179 Last 25 log lines:10 > test wal2json ... ok 23 ms11 > test z_orioledb-17_docs-cascades-deletes ... ok 93 ms12 > test z_orioledb-17_docs-full-text-search ... ok 35 ms13 > test z_orioledb-17_docs-functions ... ok 454 ms14 > test z_orioledb-17_docs-indexes ... ok 30 ms15 > test z_orioledb-17_docs-partitioning ... ok 42 ms16 > test z_orioledb-17_ext_interface ... FAILED 114 ms17 > test z_orioledb-17_extensions_schema ... ok 8 ms18 > test z_orioledb-17_intarray_ltree_query ... ok 10 ms19 > test z_orioledb-17_pg_stat_monitor ... ok 7 ms20 > test z_orioledb-17_pgroonga ... ok 55 ms21 > test z_orioledb-17_pgvector ... ok 18 ms22 > test z_orioledb-17_verify_orioledb ... ok 15 ms23 >24 > =======================25 > 2 of 65 tests failed.26 > =======================27 >28 > The differences that caused some tests to fail can be viewed in the29 > file "/nix/store/2d1mng6hp6zkpjpmnp4fvp7d1wmzy6kg-run-check-harness-psql-orioledb-17/regression_output/regression.diffs". A copy of the test summary that you see30 > above is saved in the file "/nix/store/2d1mng6hp6zkpjpmnp4fvp7d1wmzy6kg-run-check-harness-psql-orioledb-17/regression_output/regression.out".31 >32 > 2026-10-08 01:11:11 [ERROR] pg_regress tests failed33 > 2026-10-08 01:11:11 [ERROR] An error occurred. Exit code: 134 > 2026-10-08 01:11:11 [ERROR] Debug logs:35 For full logs, run:36 nix log /nix/store/41yx977lp37qm4c932y6hqas0vjz7dvh-run-check-harness-psql-orioledb-17.drv