this derivation will be built: /nix/store/41yx977lp37qm4c932y6hqas0vjz7dvh-run-check-harness-psql-orioledb-17.drv this path will be fetched (4.5 KiB download, 16.3 KiB unpacked): /nix/store/m3yq11l5hkcy0dkarfmvi5ld3lqk7pa6-postgres-orioledb-17-check-harness error: Cannot build '/nix/store/41yx977lp37qm4c932y6hqas0vjz7dvh-run-check-harness-psql-orioledb-17.drv'. Reason: builder failed with exit code 1. Output paths: /nix/store/2d1mng6hp6zkpjpmnp4fvp7d1wmzy6kg-run-check-harness-psql-orioledb-17 Last 25 log lines: > test wal2json ... ok 23 ms > test z_orioledb-17_docs-cascades-deletes ... ok 93 ms > test z_orioledb-17_docs-full-text-search ... ok 35 ms > test z_orioledb-17_docs-functions ... ok 454 ms > test z_orioledb-17_docs-indexes ... ok 30 ms > test z_orioledb-17_docs-partitioning ... ok 42 ms > test z_orioledb-17_ext_interface ... FAILED 114 ms > test z_orioledb-17_extensions_schema ... ok 8 ms > test z_orioledb-17_intarray_ltree_query ... ok 10 ms > test z_orioledb-17_pg_stat_monitor ... ok 7 ms > test z_orioledb-17_pgroonga ... ok 55 ms > test z_orioledb-17_pgvector ... ok 18 ms > test z_orioledb-17_verify_orioledb ... ok 15 ms > > ======================= > 2 of 65 tests failed. > ======================= > > The differences that caused some tests to fail can be viewed in the > file "/nix/store/2d1mng6hp6zkpjpmnp4fvp7d1wmzy6kg-run-check-harness-psql-orioledb-17/regression_output/regression.diffs". A copy of the test summary that you see > above is saved in the file "/nix/store/2d1mng6hp6zkpjpmnp4fvp7d1wmzy6kg-run-check-harness-psql-orioledb-17/regression_output/regression.out". > > 2026-10-08 01:11:11 [ERROR] pg_regress tests failed > 2026-10-08 01:11:11 [ERROR] An error occurred. Exit code: 1 > 2026-10-08 01:11:11 [ERROR] Debug logs: For full logs, run: nix log /nix/store/41yx977lp37qm4c932y6hqas0vjz7dvh-run-check-harness-psql-orioledb-17.drv