setup
checks.x86_64-linux.psql_17
· build #172
· raw
1these 2 derivations will be built:2 /nix/store/wq80z19f2gp4p9p38qbl8vs97ichiy38-postgres-17-check-harness.drv3 /nix/store/5gl7b579aq6ka7r7im86b1cj2l638c4b-run-check-harness-psql-17.drv4error: Cannot build '/nix/store/5gl7b579aq6ka7r7im86b1cj2l638c4b-run-check-harness-psql-17.drv'.5 Reason: builder failed with exit code 1.6 Output paths:7 /nix/store/iya40r4az8pn1k7mx9x142xyb4dbpi5g-run-check-harness-psql-178 Last 25 log lines:9 > test roles ... ok 12 ms10 > test security ... ok 10 ms11 > test storage ... ok 15 ms12 > test supautils_reserved_roles ... ok 9 ms13 > test supautils_restrict_versions ... ok 82 ms14 > test vault ... ok 27 ms15 > test wal2json ... ok 14 ms16 > test z_17_ext_interface ... FAILED 137 ms17 > test z_17_intarray_ltree_query ... ok 13 ms18 > test z_17_pg_stat_monitor ... ok 8 ms19 > test z_17_pgvector ... ok 13 ms20 > test z_17_roles ... ok 14 ms21 > test z_17_rum ... ok 14 ms22 >23 > =======================24 > 2 of 68 tests failed.25 > =======================26 >27 > The differences that caused some tests to fail can be viewed in the28 > file "/nix/store/iya40r4az8pn1k7mx9x142xyb4dbpi5g-run-check-harness-psql-17/regression_output/regression.diffs". A copy of the test summary that you see29 > above is saved in the file "/nix/store/iya40r4az8pn1k7mx9x142xyb4dbpi5g-run-check-harness-psql-17/regression_output/regression.out".30 >31 > 2026-10-08 01:10:33 [ERROR] pg_regress tests failed32 > 2026-10-08 01:10:33 [ERROR] An error occurred. Exit code: 133 > 2026-10-08 01:10:33 [ERROR] Debug logs:34 For full logs, run:35 nix log /nix/store/5gl7b579aq6ka7r7im86b1cj2l638c4b-run-check-harness-psql-17.drv