these 2 derivations will be built: /nix/store/wq80z19f2gp4p9p38qbl8vs97ichiy38-postgres-17-check-harness.drv /nix/store/5gl7b579aq6ka7r7im86b1cj2l638c4b-run-check-harness-psql-17.drv error: Cannot build '/nix/store/5gl7b579aq6ka7r7im86b1cj2l638c4b-run-check-harness-psql-17.drv'. Reason: builder failed with exit code 1. Output paths: /nix/store/iya40r4az8pn1k7mx9x142xyb4dbpi5g-run-check-harness-psql-17 Last 25 log lines: > test roles ... ok 12 ms > test security ... ok 10 ms > test storage ... ok 15 ms > test supautils_reserved_roles ... ok 9 ms > test supautils_restrict_versions ... ok 82 ms > test vault ... ok 27 ms > test wal2json ... ok 14 ms > test z_17_ext_interface ... FAILED 137 ms > test z_17_intarray_ltree_query ... ok 13 ms > test z_17_pg_stat_monitor ... ok 8 ms > test z_17_pgvector ... ok 13 ms > test z_17_roles ... ok 14 ms > test z_17_rum ... ok 14 ms > > ======================= > 2 of 68 tests failed. > ======================= > > The differences that caused some tests to fail can be viewed in the > file "/nix/store/iya40r4az8pn1k7mx9x142xyb4dbpi5g-run-check-harness-psql-17/regression_output/regression.diffs". A copy of the test summary that you see > above is saved in the file "/nix/store/iya40r4az8pn1k7mx9x142xyb4dbpi5g-run-check-harness-psql-17/regression_output/regression.out". > > 2026-10-08 01:10:33 [ERROR] pg_regress tests failed > 2026-10-08 01:10:33 [ERROR] An error occurred. Exit code: 1 > 2026-10-08 01:10:33 [ERROR] Debug logs: For full logs, run: nix log /nix/store/5gl7b579aq6ka7r7im86b1cj2l638c4b-run-check-harness-psql-17.drv