setup
checks.x86_64-linux.psql_15_slim
· build #169
· raw
1these 3 derivations will be built:2 /nix/store/x8d5wzrx1jmkgxxkjxxa1hap06qq8wvq-start-postgres-server-test.drv3 /nix/store/rxmvp1idz2wmv1sanacy9lpm7sqxymyc-postgres-15-check-harness.drv4 /nix/store/f32kyxfdv38vylqrxa46lsnm8f7yingv-run-check-harness-psql-15-slim.drv5error: Cannot build '/nix/store/f32kyxfdv38vylqrxa46lsnm8f7yingv-run-check-harness-psql-15-slim.drv'.6 Reason: builder failed with exit code 1.7 Output paths:8 /nix/store/vi8a4kjhgscr0bg0d8jn7bjp47c36cg0-run-check-harness-psql-15-slim9 Last 25 log lines:10 > test supautils_restrict_versions ... ok 83 ms11 > test vault ... ok 30 ms12 > test wal2json ... ok 15 ms13 > test z_15_ext_interface ... FAILED 684 ms14 > test z_15_intarray_ltree_query ... ok 11 ms15 > test z_15_pg_stat_monitor ... ok 11 ms16 > test z_15_pgjwt ... ok 19 ms17 > test z_15_pgvector ... ok 31 ms18 > test z_15_plv8 ... ok 52 ms19 > test z_15_roles ... ok 18 ms20 > test z_15_rum ... ok 18 ms21 > test z_15_timescale ... ok 25 ms22 > test z_15_unhype_timescale_to_partman ... ok 11945 ms23 >24 > =======================25 > 2 of 72 tests failed.26 > =======================27 >28 > The differences that caused some tests to fail can be viewed in the29 > file "/nix/store/vi8a4kjhgscr0bg0d8jn7bjp47c36cg0-run-check-harness-psql-15-slim/regression_output/regression.diffs". A copy of the test summary that you see30 > above is saved in the file "/nix/store/vi8a4kjhgscr0bg0d8jn7bjp47c36cg0-run-check-harness-psql-15-slim/regression_output/regression.out".31 >32 > 2026-10-08 00:10:31 [ERROR] pg_regress tests failed33 > 2026-10-08 00:10:31 [ERROR] An error occurred. Exit code: 134 > 2026-10-08 00:10:31 [ERROR] Debug logs:35 For full logs, run:36 nix log /nix/store/f32kyxfdv38vylqrxa46lsnm8f7yingv-run-check-harness-psql-15-slim.drv