nixbot

builds

supabase/postgres build #169 failed

branch develop · PR #2521 · commit 8a35d2263c · · took 27m 50s · eval 5m 16s

9 failed
failed attributes
status attribute duration
failed checks.aarch64-linux.psql_15 2m 10s
run-check-harness-psql-15: 2 of 72 tests failed. ======================= The differences that caused some tests to fail can be viewed in the file "/nix/store/ …
run-check-harness-psql-15:
 2 of 72 tests failed. 
=======================
The differences that caused some tests to fail can be viewed in the
file "/nix/store/d3qals27z1jpqym6bncj6mjk58svksp0-run-check-harness-psql-15/regression_output/regression.diffs".  A copy of the test summary that you see
above is saved in the file "/nix/store/d3qals27z1jpqym6bncj6mjk58svksp0-run-check-harness-psql-15/regression_output/regression.out".
2026-10-07 23:48:08 [ERROR] pg_regress tests failed
2026-10-07 23:48:08 [ERROR] An error occurred. Exit code: 1
2026-10-07 23:48:08 [ERROR] Debug logs:
failed checks.aarch64-linux.psql_15_slim 1m 39s
run-check-harness-psql-15-slim: 2 of 72 tests failed. ======================= The differences that caused some tests to fail can be viewed in the file "/nix/s …
run-check-harness-psql-15-slim:
 2 of 72 tests failed. 
=======================
The differences that caused some tests to fail can be viewed in the
file "/nix/store/qaj1y9igskwfvxr7k0a0dm0iwh81bswn-run-check-harness-psql-15-slim/regression_output/regression.diffs".  A copy of the test summary that you see
above is saved in the file "/nix/store/qaj1y9igskwfvxr7k0a0dm0iwh81bswn-run-check-harness-psql-15-slim/regression_output/regression.out".
2026-10-07 23:48:08 [ERROR] pg_regress tests failed
2026-10-07 23:48:08 [ERROR] An error occurred. Exit code: 1
2026-10-07 23:48:08 [ERROR] Debug logs:
failed checks.aarch64-linux.psql_17 1m 15s
run-check-harness-psql-17: 2 of 68 tests failed. ======================= The differences that caused some tests to fail can be viewed in the file "/nix/store/ …
run-check-harness-psql-17:
 2 of 68 tests failed. 
=======================
The differences that caused some tests to fail can be viewed in the
file "/nix/store/4ynvg2fi6iiaz4csllbb19vqkvk8w3zs-run-check-harness-psql-17/regression_output/regression.diffs".  A copy of the test summary that you see
above is saved in the file "/nix/store/4ynvg2fi6iiaz4csllbb19vqkvk8w3zs-run-check-harness-psql-17/regression_output/regression.out".
2026-10-07 23:47:16 [ERROR] pg_regress tests failed
2026-10-07 23:47:16 [ERROR] An error occurred. Exit code: 1
2026-10-07 23:47:16 [ERROR] Debug logs:
failed checks.aarch64-linux.psql_17_slim 1m 0s
run-check-harness-psql-17-slim: 2 of 68 tests failed. ======================= The differences that caused some tests to fail can be viewed in the file "/nix/s …
run-check-harness-psql-17-slim:
 2 of 68 tests failed. 
=======================
The differences that caused some tests to fail can be viewed in the
file "/nix/store/ccgkcvzzdvg5wbs6srlbhglyb7f07cl5-run-check-harness-psql-17-slim/regression_output/regression.diffs".  A copy of the test summary that you see
above is saved in the file "/nix/store/ccgkcvzzdvg5wbs6srlbhglyb7f07cl5-run-check-harness-psql-17-slim/regression_output/regression.out".
2026-10-07 23:47:30 [ERROR] pg_regress tests failed
2026-10-07 23:47:30 [ERROR] An error occurred. Exit code: 1
2026-10-07 23:47:30 [ERROR] Debug logs:
failed checks.aarch64-linux.psql_orioledb-17 58s
run-check-harness-psql-orioledb-17: 2 of 65 tests failed. ======================= The differences that caused some tests to fail can be viewed in the file "/n …
run-check-harness-psql-orioledb-17:
 2 of 65 tests failed. 
=======================
The differences that caused some tests to fail can be viewed in the
file "/nix/store/cgrhr8pgz0nbhwmfn1l5arv2n906r4lh-run-check-harness-psql-orioledb-17/regression_output/regression.diffs".  A copy of the test summary that you see
above is saved in the file "/nix/store/cgrhr8pgz0nbhwmfn1l5arv2n906r4lh-run-check-harness-psql-orioledb-17/regression_output/regression.out".
2026-10-07 23:47:19 [ERROR] pg_regress tests failed
2026-10-07 23:47:19 [ERROR] An error occurred. Exit code: 1
2026-10-07 23:47:19 [ERROR] Debug logs:
failed checks.aarch64-linux.psql_orioledb-17_slim 52s
run-check-harness-psql-orioledb-17-slim: 2 of 65 tests failed. ======================= The differences that caused some tests to fail can be viewed in the fil …
run-check-harness-psql-orioledb-17-slim:
 2 of 65 tests failed. 
=======================
The differences that caused some tests to fail can be viewed in the
file "/nix/store/3anqbh74cs398zlddjakmc18q5q9ljk7-run-check-harness-psql-orioledb-17-slim/regression_output/regression.diffs".  A copy of the test summary that you see
above is saved in the file "/nix/store/3anqbh74cs398zlddjakmc18q5q9ljk7-run-check-harness-psql-orioledb-17-slim/regression_output/regression.out".
2026-10-07 23:47:43 [ERROR] pg_regress tests failed
2026-10-07 23:47:43 [ERROR] An error occurred. Exit code: 1
2026-10-07 23:47:43 [ERROR] Debug logs:
failed checks.x86_64-linux.psql_15 1m 51s
run-check-harness-psql-15: 2 of 72 tests failed. ======================= The differences that caused some tests to fail can be viewed in the file "/nix/store/ …
run-check-harness-psql-15:
 2 of 72 tests failed. 
=======================
The differences that caused some tests to fail can be viewed in the
file "/nix/store/zj94ir5hxqavk9fqwwzf783zmf19ad43-run-check-harness-psql-15/regression_output/regression.diffs".  A copy of the test summary that you see
above is saved in the file "/nix/store/zj94ir5hxqavk9fqwwzf783zmf19ad43-run-check-harness-psql-15/regression_output/regression.out".
2026-10-08 00:10:23 [ERROR] pg_regress tests failed
2026-10-08 00:10:23 [ERROR] An error occurred. Exit code: 1
2026-10-08 00:10:24 [ERROR] Debug logs:
failed checks.x86_64-linux.psql_15_slim 1m 6s
run-check-harness-psql-15-slim: 2 of 72 tests failed. ======================= The differences that caused some tests to fail can be viewed in the file "/nix/s …
run-check-harness-psql-15-slim:
 2 of 72 tests failed. 
=======================
The differences that caused some tests to fail can be viewed in the
file "/nix/store/vi8a4kjhgscr0bg0d8jn7bjp47c36cg0-run-check-harness-psql-15-slim/regression_output/regression.diffs".  A copy of the test summary that you see
above is saved in the file "/nix/store/vi8a4kjhgscr0bg0d8jn7bjp47c36cg0-run-check-harness-psql-15-slim/regression_output/regression.out".
2026-10-08 00:10:31 [ERROR] pg_regress tests failed
2026-10-08 00:10:31 [ERROR] An error occurred. Exit code: 1
2026-10-08 00:10:31 [ERROR] Debug logs:
failed checks.x86_64-linux.psql_orioledb-17 40s
run-check-harness-psql-orioledb-17: 2 of 65 tests failed. ======================= The differences that caused some tests to fail can be viewed in the file "/n …
run-check-harness-psql-orioledb-17:
 2 of 65 tests failed. 
=======================
The differences that caused some tests to fail can be viewed in the
file "/nix/store/ihwmsy2la6yar4njn54b6c32kay953aa-run-check-harness-psql-orioledb-17/regression_output/regression.diffs".  A copy of the test summary that you see
above is saved in the file "/nix/store/ihwmsy2la6yar4njn54b6c32kay953aa-run-check-harness-psql-orioledb-17/regression_output/regression.out".
2026-10-08 00:11:04 [ERROR] pg_regress tests failed
2026-10-08 00:11:04 [ERROR] An error occurred. Exit code: 1
2026-10-08 00:11:04 [ERROR] Debug logs:
41 cancelled
cancelled attributes
status attribute duration
loading…
38 succeeded
succeeded attributes
status attribute duration
loading…
36 already built
skipped attributes
status attribute duration
loading…