nixbot

builds

supabase/postgres build #168 failed

branch develop · PR #2506 · commit 2e1e7ae41e · · took 1h 39m · eval 7m 46s

12 failed
failed attributes
status attribute duration
failed checks.aarch64-linux.psql_15 1m 35s
run-check-harness-psql-15: 2 of 72 tests failed. ======================= The differences that caused some tests to fail can be viewed in the file "/nix/store/ …
run-check-harness-psql-15:
 2 of 72 tests failed. 
=======================
The differences that caused some tests to fail can be viewed in the
file "/nix/store/v4nmhhy32515j4nygc0q8kzwgvvadsa5-run-check-harness-psql-15/regression_output/regression.diffs".  A copy of the test summary that you see
above is saved in the file "/nix/store/v4nmhhy32515j4nygc0q8kzwgvvadsa5-run-check-harness-psql-15/regression_output/regression.out".
2026-10-07 23:25:42 [ERROR] pg_regress tests failed
2026-10-07 23:25:42 [ERROR] An error occurred. Exit code: 1
2026-10-07 23:25:42 [ERROR] Debug logs:
failed checks.aarch64-linux.psql_15_slim 1m 35s
run-check-harness-psql-15-slim: 2 of 72 tests failed. ======================= The differences that caused some tests to fail can be viewed in the file "/nix/s …
run-check-harness-psql-15-slim:
 2 of 72 tests failed. 
=======================
The differences that caused some tests to fail can be viewed in the
file "/nix/store/1fcair1pg7l3spd3qc0mz45jiwgcn26d-run-check-harness-psql-15-slim/regression_output/regression.diffs".  A copy of the test summary that you see
above is saved in the file "/nix/store/1fcair1pg7l3spd3qc0mz45jiwgcn26d-run-check-harness-psql-15-slim/regression_output/regression.out".
2026-10-07 23:25:43 [ERROR] pg_regress tests failed
2026-10-07 23:25:43 [ERROR] An error occurred. Exit code: 1
2026-10-07 23:25:43 [ERROR] Debug logs:
failed checks.aarch64-linux.psql_17 46s
run-check-harness-psql-17: 2 of 68 tests failed. ======================= The differences that caused some tests to fail can be viewed in the file "/nix/store/ …
run-check-harness-psql-17:
 2 of 68 tests failed. 
=======================
The differences that caused some tests to fail can be viewed in the
file "/nix/store/b4bfbrbbcfw6vz54zaw01qvglhmg2vcr-run-check-harness-psql-17/regression_output/regression.diffs".  A copy of the test summary that you see
above is saved in the file "/nix/store/b4bfbrbbcfw6vz54zaw01qvglhmg2vcr-run-check-harness-psql-17/regression_output/regression.out".
2026-10-07 23:24:53 [ERROR] pg_regress tests failed
2026-10-07 23:24:53 [ERROR] An error occurred. Exit code: 1
2026-10-07 23:24:53 [ERROR] Debug logs:
failed checks.aarch64-linux.psql_17_slim 1m 16s
run-check-harness-psql-17-slim: 2 of 68 tests failed. ======================= The differences that caused some tests to fail can be viewed in the file "/nix/s …
run-check-harness-psql-17-slim:
 2 of 68 tests failed. 
=======================
The differences that caused some tests to fail can be viewed in the
file "/nix/store/q3wlp5xgmlbbkpc0812rrr8xs4yxgwnr-run-check-harness-psql-17-slim/regression_output/regression.diffs".  A copy of the test summary that you see
above is saved in the file "/nix/store/q3wlp5xgmlbbkpc0812rrr8xs4yxgwnr-run-check-harness-psql-17-slim/regression_output/regression.out".
2026-10-07 23:25:23 [ERROR] pg_regress tests failed
2026-10-07 23:25:23 [ERROR] An error occurred. Exit code: 1
2026-10-07 23:25:23 [ERROR] Debug logs:
failed checks.aarch64-linux.psql_orioledb-17 1m 18s
run-check-harness-psql-orioledb-17: 2 of 65 tests failed. ======================= The differences that caused some tests to fail can be viewed in the file "/n …
run-check-harness-psql-orioledb-17:
 2 of 65 tests failed. 
=======================
The differences that caused some tests to fail can be viewed in the
file "/nix/store/sgmvw9xcqhrr6ardfyb4d3z68kpg166l-run-check-harness-psql-orioledb-17/regression_output/regression.diffs".  A copy of the test summary that you see
above is saved in the file "/nix/store/sgmvw9xcqhrr6ardfyb4d3z68kpg166l-run-check-harness-psql-orioledb-17/regression_output/regression.out".
2026-10-07 23:25:25 [ERROR] pg_regress tests failed
2026-10-07 23:25:25 [ERROR] An error occurred. Exit code: 1
2026-10-07 23:25:25 [ERROR] Debug logs:
failed checks.aarch64-linux.psql_orioledb-17_slim 47s
run-check-harness-psql-orioledb-17-slim: 2 of 65 tests failed. ======================= The differences that caused some tests to fail can be viewed in the fil …
run-check-harness-psql-orioledb-17-slim:
 2 of 65 tests failed. 
=======================
The differences that caused some tests to fail can be viewed in the
file "/nix/store/54zq45vsk8bfr3jwywndl74h55yqypk1-run-check-harness-psql-orioledb-17-slim/regression_output/regression.diffs".  A copy of the test summary that you see
above is saved in the file "/nix/store/54zq45vsk8bfr3jwywndl74h55yqypk1-run-check-harness-psql-orioledb-17-slim/regression_output/regression.out".
2026-10-07 23:26:13 [ERROR] pg_regress tests failed
2026-10-07 23:26:13 [ERROR] An error occurred. Exit code: 1
2026-10-07 23:26:13 [ERROR] Debug logs:
failed checks.x86_64-linux.psql_15 1m 0s
run-check-harness-psql-15: 2 of 72 tests failed. ======================= The differences that caused some tests to fail can be viewed in the file "/nix/store/ …
run-check-harness-psql-15:
 2 of 72 tests failed. 
=======================
The differences that caused some tests to fail can be viewed in the
file "/nix/store/izpvlrnsirc271lxbxzmhpr0d6my0l4m-run-check-harness-psql-15/regression_output/regression.diffs".  A copy of the test summary that you see
above is saved in the file "/nix/store/izpvlrnsirc271lxbxzmhpr0d6my0l4m-run-check-harness-psql-15/regression_output/regression.out".
2026-10-07 23:26:58 [ERROR] pg_regress tests failed
2026-10-07 23:26:58 [ERROR] An error occurred. Exit code: 1
2026-10-07 23:26:58 [ERROR] Debug logs:
failed checks.x86_64-linux.psql_15_slim 59s
run-check-harness-psql-15-slim: 2 of 72 tests failed. ======================= The differences that caused some tests to fail can be viewed in the file "/nix/s …
run-check-harness-psql-15-slim:
 2 of 72 tests failed. 
=======================
The differences that caused some tests to fail can be viewed in the
file "/nix/store/5sii00imv410hd3j6spjp0h5ahl5fs4m-run-check-harness-psql-15-slim/regression_output/regression.diffs".  A copy of the test summary that you see
above is saved in the file "/nix/store/5sii00imv410hd3j6spjp0h5ahl5fs4m-run-check-harness-psql-15-slim/regression_output/regression.out".
2026-10-07 23:27:29 [ERROR] pg_regress tests failed
2026-10-07 23:27:29 [ERROR] An error occurred. Exit code: 1
2026-10-07 23:27:29 [ERROR] Debug logs:
failed checks.x86_64-linux.psql_17 31s
run-check-harness-psql-17: 2 of 68 tests failed. ======================= The differences that caused some tests to fail can be viewed in the file "/nix/store/ …
run-check-harness-psql-17:
 2 of 68 tests failed. 
=======================
The differences that caused some tests to fail can be viewed in the
file "/nix/store/jcgk6mn417qxj0m4whbr1q5br7a2ivqw-run-check-harness-psql-17/regression_output/regression.diffs".  A copy of the test summary that you see
above is saved in the file "/nix/store/jcgk6mn417qxj0m4whbr1q5br7a2ivqw-run-check-harness-psql-17/regression_output/regression.out".
2026-10-07 23:26:30 [ERROR] pg_regress tests failed
2026-10-07 23:26:30 [ERROR] An error occurred. Exit code: 1
2026-10-07 23:26:30 [ERROR] Debug logs:
failed checks.x86_64-linux.psql_17_slim 31s
run-check-harness-psql-17-slim: 2 of 68 tests failed. ======================= The differences that caused some tests to fail can be viewed in the file "/nix/s …
run-check-harness-psql-17-slim:
 2 of 68 tests failed. 
=======================
The differences that caused some tests to fail can be viewed in the
file "/nix/store/kk0ggr6lhg4dlkc75d5hjylzc50lfz4x-run-check-harness-psql-17-slim/regression_output/regression.diffs".  A copy of the test summary that you see
above is saved in the file "/nix/store/kk0ggr6lhg4dlkc75d5hjylzc50lfz4x-run-check-harness-psql-17-slim/regression_output/regression.out".
2026-10-07 23:26:30 [ERROR] pg_regress tests failed
2026-10-07 23:26:30 [ERROR] An error occurred. Exit code: 1
2026-10-07 23:26:30 [ERROR] Debug logs:
failed checks.x86_64-linux.psql_orioledb-17 31s
run-check-harness-psql-orioledb-17: 2 of 65 tests failed. ======================= The differences that caused some tests to fail can be viewed in the file "/n …
run-check-harness-psql-orioledb-17:
 2 of 65 tests failed. 
=======================
The differences that caused some tests to fail can be viewed in the
file "/nix/store/0xs5am6v818na2323g5ar3ylhwfsf901-run-check-harness-psql-orioledb-17/regression_output/regression.diffs".  A copy of the test summary that you see
above is saved in the file "/nix/store/0xs5am6v818na2323g5ar3ylhwfsf901-run-check-harness-psql-orioledb-17/regression_output/regression.out".
2026-10-07 23:27:05 [ERROR] pg_regress tests failed
2026-10-07 23:27:05 [ERROR] An error occurred. Exit code: 1
2026-10-07 23:27:05 [ERROR] Debug logs:
failed checks.x86_64-linux.psql_orioledb-17_slim 31s
run-check-harness-psql-orioledb-17-slim: 2 of 65 tests failed. ======================= The differences that caused some tests to fail can be viewed in the fil …
run-check-harness-psql-orioledb-17-slim:
 2 of 65 tests failed. 
=======================
The differences that caused some tests to fail can be viewed in the
file "/nix/store/szwyrd3633qp2zcp6mk88d99cpkcf1r6-run-check-harness-psql-orioledb-17-slim/regression_output/regression.diffs".  A copy of the test summary that you see
above is saved in the file "/nix/store/szwyrd3633qp2zcp6mk88d99cpkcf1r6-run-check-harness-psql-orioledb-17-slim/regression_output/regression.out".
2026-10-07 23:27:01 [ERROR] pg_regress tests failed
2026-10-07 23:27:01 [ERROR] An error occurred. Exit code: 1
2026-10-07 23:27:01 [ERROR] Debug logs:
62 succeeded
succeeded attributes
status attribute duration
loading…
50 already built
skipped attributes
status attribute duration
loading…