nixbot

builds

supabase/postgres build #167 failed

branch develop · PR #2506 · commit 4d33b222d4 · · took 39m 55s · eval 2m 55s

12 failed
failed attributes
status attribute duration
failed checks.aarch64-linux.psql_15 1m 33s
run-check-harness-psql-15: 2 of 72 tests failed. ======================= The differences that caused some tests to fail can be viewed in the file "/nix/store/ …
run-check-harness-psql-15:
 2 of 72 tests failed. 
=======================
The differences that caused some tests to fail can be viewed in the
file "/nix/store/216nm8dd33hj4f9dfhwsf0pfnyhk7rs9-run-check-harness-psql-15/regression_output/regression.diffs".  A copy of the test summary that you see
above is saved in the file "/nix/store/216nm8dd33hj4f9dfhwsf0pfnyhk7rs9-run-check-harness-psql-15/regression_output/regression.out".
2026-10-07 22:07:45 [ERROR] pg_regress tests failed
2026-10-07 22:07:45 [ERROR] An error occurred. Exit code: 1
2026-10-07 22:07:45 [ERROR] Debug logs:
failed checks.aarch64-linux.psql_15_slim 1m 42s
run-check-harness-psql-15-slim: 2 of 72 tests failed. ======================= The differences that caused some tests to fail can be viewed in the file "/nix/s …
run-check-harness-psql-15-slim:
 2 of 72 tests failed. 
=======================
The differences that caused some tests to fail can be viewed in the
file "/nix/store/sfjp9q7rb5ilyvbvi5w9alk4n2lv1al6-run-check-harness-psql-15-slim/regression_output/regression.diffs".  A copy of the test summary that you see
above is saved in the file "/nix/store/sfjp9q7rb5ilyvbvi5w9alk4n2lv1al6-run-check-harness-psql-15-slim/regression_output/regression.out".
2026-10-07 22:07:57 [ERROR] pg_regress tests failed
2026-10-07 22:07:57 [ERROR] An error occurred. Exit code: 1
2026-10-07 22:07:57 [ERROR] Debug logs:
failed checks.aarch64-linux.psql_17 50s
run-check-harness-psql-17: 2 of 68 tests failed. ======================= The differences that caused some tests to fail can be viewed in the file "/nix/store/ …
run-check-harness-psql-17:
 2 of 68 tests failed. 
=======================
The differences that caused some tests to fail can be viewed in the
file "/nix/store/i4kwsmayjyizqi57vvf9kdnxcdnq7lvy-run-check-harness-psql-17/regression_output/regression.diffs".  A copy of the test summary that you see
above is saved in the file "/nix/store/i4kwsmayjyizqi57vvf9kdnxcdnq7lvy-run-check-harness-psql-17/regression_output/regression.out".
2026-10-07 22:07:03 [ERROR] pg_regress tests failed
2026-10-07 22:07:03 [ERROR] An error occurred. Exit code: 1
2026-10-07 22:07:03 [ERROR] Debug logs:
failed checks.aarch64-linux.psql_17_slim 46s
run-check-harness-psql-17-slim: 2 of 68 tests failed. ======================= The differences that caused some tests to fail can be viewed in the file "/nix/s …
run-check-harness-psql-17-slim:
 2 of 68 tests failed. 
=======================
The differences that caused some tests to fail can be viewed in the
file "/nix/store/32f42i9grdipqmk651ywnifw59p21rgw-run-check-harness-psql-17-slim/regression_output/regression.diffs".  A copy of the test summary that you see
above is saved in the file "/nix/store/32f42i9grdipqmk651ywnifw59p21rgw-run-check-harness-psql-17-slim/regression_output/regression.out".
2026-10-07 22:07:49 [ERROR] pg_regress tests failed
2026-10-07 22:07:50 [ERROR] An error occurred. Exit code: 1
2026-10-07 22:07:50 [ERROR] Debug logs:
failed checks.aarch64-linux.psql_orioledb-17 48s
run-check-harness-psql-orioledb-17: 2 of 65 tests failed. ======================= The differences that caused some tests to fail can be viewed in the file "/n …
run-check-harness-psql-orioledb-17:
 2 of 65 tests failed. 
=======================
The differences that caused some tests to fail can be viewed in the
file "/nix/store/mdn0c9id7lpyvyrq9sbjwyq410mh2vdz-run-check-harness-psql-orioledb-17/regression_output/regression.diffs".  A copy of the test summary that you see
above is saved in the file "/nix/store/mdn0c9id7lpyvyrq9sbjwyq410mh2vdz-run-check-harness-psql-orioledb-17/regression_output/regression.out".
2026-10-07 22:07:38 [ERROR] pg_regress tests failed
2026-10-07 22:07:38 [ERROR] An error occurred. Exit code: 1
2026-10-07 22:07:38 [ERROR] Debug logs:
failed checks.aarch64-linux.psql_orioledb-17_slim 46s
run-check-harness-psql-orioledb-17-slim: 2 of 65 tests failed. ======================= The differences that caused some tests to fail can be viewed in the fil …
run-check-harness-psql-orioledb-17-slim:
 2 of 65 tests failed. 
=======================
The differences that caused some tests to fail can be viewed in the
file "/nix/store/dw3bd10zfvfq1phlc71paz7nq9my9m5k-run-check-harness-psql-orioledb-17-slim/regression_output/regression.diffs".  A copy of the test summary that you see
above is saved in the file "/nix/store/dw3bd10zfvfq1phlc71paz7nq9my9m5k-run-check-harness-psql-orioledb-17-slim/regression_output/regression.out".
2026-10-07 22:11:05 [ERROR] pg_regress tests failed
2026-10-07 22:11:05 [ERROR] An error occurred. Exit code: 1
2026-10-07 22:11:05 [ERROR] Debug logs:
failed checks.x86_64-linux.psql_15 1m 1s
run-check-harness-psql-15: 2 of 72 tests failed. ======================= The differences that caused some tests to fail can be viewed in the file "/nix/store/ …
run-check-harness-psql-15:
 2 of 72 tests failed. 
=======================
The differences that caused some tests to fail can be viewed in the
file "/nix/store/qyayl1m2acmag8jdhprlx8bjxpagxmnr-run-check-harness-psql-15/regression_output/regression.diffs".  A copy of the test summary that you see
above is saved in the file "/nix/store/qyayl1m2acmag8jdhprlx8bjxpagxmnr-run-check-harness-psql-15/regression_output/regression.out".
2026-10-07 22:14:37 [ERROR] pg_regress tests failed
2026-10-07 22:14:37 [ERROR] An error occurred. Exit code: 1
2026-10-07 22:14:37 [ERROR] Debug logs:
failed checks.x86_64-linux.psql_15_slim 1m 1s
run-check-harness-psql-15-slim: 2 of 72 tests failed. ======================= The differences that caused some tests to fail can be viewed in the file "/nix/s …
run-check-harness-psql-15-slim:
 2 of 72 tests failed. 
=======================
The differences that caused some tests to fail can be viewed in the
file "/nix/store/xpw0v0rascrw6qk37z3wb493bvjznj25-run-check-harness-psql-15-slim/regression_output/regression.diffs".  A copy of the test summary that you see
above is saved in the file "/nix/store/xpw0v0rascrw6qk37z3wb493bvjznj25-run-check-harness-psql-15-slim/regression_output/regression.out".
2026-10-07 22:14:53 [ERROR] pg_regress tests failed
2026-10-07 22:14:53 [ERROR] An error occurred. Exit code: 1
2026-10-07 22:14:53 [ERROR] Debug logs:
failed checks.x86_64-linux.psql_17 33s
run-check-harness-psql-17: 2 of 68 tests failed. ======================= The differences that caused some tests to fail can be viewed in the file "/nix/store/ …
run-check-harness-psql-17:
 2 of 68 tests failed. 
=======================
The differences that caused some tests to fail can be viewed in the
file "/nix/store/dadgs0ndsn7v218x9mdg804mmf4kj7k6-run-check-harness-psql-17/regression_output/regression.diffs".  A copy of the test summary that you see
above is saved in the file "/nix/store/dadgs0ndsn7v218x9mdg804mmf4kj7k6-run-check-harness-psql-17/regression_output/regression.out".
2026-10-07 22:14:23 [ERROR] pg_regress tests failed
2026-10-07 22:14:23 [ERROR] An error occurred. Exit code: 1
2026-10-07 22:14:23 [ERROR] Debug logs:
failed checks.x86_64-linux.psql_17_slim 33s
run-check-harness-psql-17-slim: 2 of 68 tests failed. ======================= The differences that caused some tests to fail can be viewed in the file "/nix/s …
run-check-harness-psql-17-slim:
 2 of 68 tests failed. 
=======================
The differences that caused some tests to fail can be viewed in the
file "/nix/store/2v0c3brjfn77qkf6y64jxrgrmsinsw2v-run-check-harness-psql-17-slim/regression_output/regression.diffs".  A copy of the test summary that you see
above is saved in the file "/nix/store/2v0c3brjfn77qkf6y64jxrgrmsinsw2v-run-check-harness-psql-17-slim/regression_output/regression.out".
2026-10-07 22:14:20 [ERROR] pg_regress tests failed
2026-10-07 22:14:20 [ERROR] An error occurred. Exit code: 1
2026-10-07 22:14:20 [ERROR] Debug logs:
failed checks.x86_64-linux.psql_orioledb-17 33s
run-check-harness-psql-orioledb-17: 2 of 65 tests failed. ======================= The differences that caused some tests to fail can be viewed in the file "/n …
run-check-harness-psql-orioledb-17:
 2 of 65 tests failed. 
=======================
The differences that caused some tests to fail can be viewed in the
file "/nix/store/6b9ynxd8ca6y62iqrmimjajyympfm5i9-run-check-harness-psql-orioledb-17/regression_output/regression.diffs".  A copy of the test summary that you see
above is saved in the file "/nix/store/6b9ynxd8ca6y62iqrmimjajyympfm5i9-run-check-harness-psql-orioledb-17/regression_output/regression.out".
2026-10-07 22:14:50 [ERROR] pg_regress tests failed
2026-10-07 22:14:50 [ERROR] An error occurred. Exit code: 1
2026-10-07 22:14:50 [ERROR] Debug logs:
failed checks.x86_64-linux.psql_orioledb-17_slim 33s
run-check-harness-psql-orioledb-17-slim: 2 of 65 tests failed. ======================= The differences that caused some tests to fail can be viewed in the fil …
run-check-harness-psql-orioledb-17-slim:
 2 of 65 tests failed. 
=======================
The differences that caused some tests to fail can be viewed in the
file "/nix/store/4s7m5kxhmaaivj7v0svx9brh7g79zx39-run-check-harness-psql-orioledb-17-slim/regression_output/regression.diffs".  A copy of the test summary that you see
above is saved in the file "/nix/store/4s7m5kxhmaaivj7v0svx9brh7g79zx39-run-check-harness-psql-orioledb-17-slim/regression_output/regression.out".
2026-10-07 22:14:51 [ERROR] pg_regress tests failed
2026-10-07 22:14:52 [ERROR] An error occurred. Exit code: 1
2026-10-07 22:14:52 [ERROR] Debug logs:
65 succeeded
succeeded attributes
status attribute duration
loading…
47 already built
skipped attributes
status attribute duration
loading…