nixbot

builds

supabase/postgres build #166 failed

branch develop · PR #2506 · commit 370a48e1aa · · took 20m 35s · eval 8m 7s

12 failed
failed attributes
status attribute duration
failed checks.aarch64-linux.psql_15 1m 38s
run-check-harness-psql-15: 2 of 72 tests failed. ======================= The differences that caused some tests to fail can be viewed in the file "/nix/store/ …
run-check-harness-psql-15:
 2 of 72 tests failed. 
=======================
The differences that caused some tests to fail can be viewed in the
file "/nix/store/qk6mv8q235gz32k59mw530kidwhnlz7j-run-check-harness-psql-15/regression_output/regression.diffs".  A copy of the test summary that you see
above is saved in the file "/nix/store/qk6mv8q235gz32k59mw530kidwhnlz7j-run-check-harness-psql-15/regression_output/regression.out".
2026-10-07 21:52:53 [ERROR] pg_regress tests failed
2026-10-07 21:52:53 [ERROR] An error occurred. Exit code: 1
2026-10-07 21:52:53 [ERROR] Debug logs:
failed checks.aarch64-linux.psql_15_slim 1m 38s
run-check-harness-psql-15-slim: 2 of 72 tests failed. ======================= The differences that caused some tests to fail can be viewed in the file "/nix/s …
run-check-harness-psql-15-slim:
 2 of 72 tests failed. 
=======================
The differences that caused some tests to fail can be viewed in the
file "/nix/store/f15mx0aj7qcybzgwxbi4i1gbg5mjs6vl-run-check-harness-psql-15-slim/regression_output/regression.diffs".  A copy of the test summary that you see
above is saved in the file "/nix/store/f15mx0aj7qcybzgwxbi4i1gbg5mjs6vl-run-check-harness-psql-15-slim/regression_output/regression.out".
2026-10-07 21:52:53 [ERROR] pg_regress tests failed
2026-10-07 21:52:53 [ERROR] An error occurred. Exit code: 1
2026-10-07 21:52:53 [ERROR] Debug logs:
failed checks.aarch64-linux.psql_17 51s
run-check-harness-psql-17: 2 of 68 tests failed. ======================= The differences that caused some tests to fail can be viewed in the file "/nix/store/ …
run-check-harness-psql-17:
 2 of 68 tests failed. 
=======================
The differences that caused some tests to fail can be viewed in the
file "/nix/store/2jxi6isf0qjp0213nfxi6xa6xzzvl3d4-run-check-harness-psql-17/regression_output/regression.diffs".  A copy of the test summary that you see
above is saved in the file "/nix/store/2jxi6isf0qjp0213nfxi6xa6xzzvl3d4-run-check-harness-psql-17/regression_output/regression.out".
2026-10-07 21:52:06 [ERROR] pg_regress tests failed
2026-10-07 21:52:06 [ERROR] An error occurred. Exit code: 1
2026-10-07 21:52:06 [ERROR] Debug logs:
failed checks.aarch64-linux.psql_17_slim 58s
run-check-harness-psql-17-slim: 2 of 68 tests failed. ======================= The differences that caused some tests to fail can be viewed in the file "/nix/s …
run-check-harness-psql-17-slim:
 2 of 68 tests failed. 
=======================
The differences that caused some tests to fail can be viewed in the
file "/nix/store/a6gybzy3a4daqlh541cxh7yvbfgrb8af-run-check-harness-psql-17-slim/regression_output/regression.diffs".  A copy of the test summary that you see
above is saved in the file "/nix/store/a6gybzy3a4daqlh541cxh7yvbfgrb8af-run-check-harness-psql-17-slim/regression_output/regression.out".
2026-10-07 21:54:35 [ERROR] pg_regress tests failed
2026-10-07 21:54:35 [ERROR] An error occurred. Exit code: 1
2026-10-07 21:54:35 [ERROR] Debug logs:
failed checks.aarch64-linux.psql_orioledb-17 50s
run-check-harness-psql-orioledb-17: 3 of 65 tests failed. ======================= The differences that caused some tests to fail can be viewed in the file "/n …
run-check-harness-psql-orioledb-17:
 3 of 65 tests failed. 
=======================
The differences that caused some tests to fail can be viewed in the
file "/nix/store/wp3z8bblh1rm97wi3bjibjcdwwanh3hj-run-check-harness-psql-orioledb-17/regression_output/regression.diffs".  A copy of the test summary that you see
above is saved in the file "/nix/store/wp3z8bblh1rm97wi3bjibjcdwwanh3hj-run-check-harness-psql-orioledb-17/regression_output/regression.out".
2026-10-07 21:53:34 [ERROR] pg_regress tests failed
2026-10-07 21:53:34 [ERROR] An error occurred. Exit code: 1
2026-10-07 21:53:34 [ERROR] Debug logs:
failed checks.aarch64-linux.psql_orioledb-17_slim 52s
run-check-harness-psql-orioledb-17-slim: 3 of 65 tests failed. ======================= The differences that caused some tests to fail can be viewed in the fil …
run-check-harness-psql-orioledb-17-slim:
 3 of 65 tests failed. 
=======================
The differences that caused some tests to fail can be viewed in the
file "/nix/store/an5icvj2apak0yg7z07i43by5xvls7r7-run-check-harness-psql-orioledb-17-slim/regression_output/regression.diffs".  A copy of the test summary that you see
above is saved in the file "/nix/store/an5icvj2apak0yg7z07i43by5xvls7r7-run-check-harness-psql-orioledb-17-slim/regression_output/regression.out".
2026-10-07 21:52:08 [ERROR] pg_regress tests failed
2026-10-07 21:52:08 [ERROR] An error occurred. Exit code: 1
2026-10-07 21:52:08 [ERROR] Debug logs:
failed checks.x86_64-linux.psql_15 58s
run-check-harness-psql-15: 2 of 72 tests failed. ======================= The differences that caused some tests to fail can be viewed in the file "/nix/store/ …
run-check-harness-psql-15:
 2 of 72 tests failed. 
=======================
The differences that caused some tests to fail can be viewed in the
file "/nix/store/m2q9skj12lvvawph8h940b54z0mwln9c-run-check-harness-psql-15/regression_output/regression.diffs".  A copy of the test summary that you see
above is saved in the file "/nix/store/m2q9skj12lvvawph8h940b54z0mwln9c-run-check-harness-psql-15/regression_output/regression.out".
2026-10-07 21:54:47 [ERROR] pg_regress tests failed
2026-10-07 21:54:47 [ERROR] An error occurred. Exit code: 1
2026-10-07 21:54:47 [ERROR] Debug logs:
failed checks.x86_64-linux.psql_15_slim 59s
run-check-harness-psql-15-slim: 2 of 72 tests failed. ======================= The differences that caused some tests to fail can be viewed in the file "/nix/s …
run-check-harness-psql-15-slim:
 2 of 72 tests failed. 
=======================
The differences that caused some tests to fail can be viewed in the
file "/nix/store/fh5d1wqadsw6jp4z87vl0ml6fifn40dp-run-check-harness-psql-15-slim/regression_output/regression.diffs".  A copy of the test summary that you see
above is saved in the file "/nix/store/fh5d1wqadsw6jp4z87vl0ml6fifn40dp-run-check-harness-psql-15-slim/regression_output/regression.out".
2026-10-07 21:55:08 [ERROR] pg_regress tests failed
2026-10-07 21:55:08 [ERROR] An error occurred. Exit code: 1
2026-10-07 21:55:09 [ERROR] Debug logs:
failed checks.x86_64-linux.psql_17 31s
run-check-harness-psql-17: 2 of 68 tests failed. ======================= The differences that caused some tests to fail can be viewed in the file "/nix/store/ …
run-check-harness-psql-17:
 2 of 68 tests failed. 
=======================
The differences that caused some tests to fail can be viewed in the
file "/nix/store/g0wly52ry5zc1hwllgg3rg01ry90nhfh-run-check-harness-psql-17/regression_output/regression.diffs".  A copy of the test summary that you see
above is saved in the file "/nix/store/g0wly52ry5zc1hwllgg3rg01ry90nhfh-run-check-harness-psql-17/regression_output/regression.out".
2026-10-07 21:55:40 [ERROR] pg_regress tests failed
2026-10-07 21:55:40 [ERROR] An error occurred. Exit code: 1
2026-10-07 21:55:40 [ERROR] Debug logs:
failed checks.x86_64-linux.psql_17_slim 31s
run-check-harness-psql-17-slim: 2 of 68 tests failed. ======================= The differences that caused some tests to fail can be viewed in the file "/nix/s …
run-check-harness-psql-17-slim:
 2 of 68 tests failed. 
=======================
The differences that caused some tests to fail can be viewed in the
file "/nix/store/5jxzz55wnyxlsrmvad9115ca6dhbwb0m-run-check-harness-psql-17-slim/regression_output/regression.diffs".  A copy of the test summary that you see
above is saved in the file "/nix/store/5jxzz55wnyxlsrmvad9115ca6dhbwb0m-run-check-harness-psql-17-slim/regression_output/regression.out".
2026-10-07 21:55:43 [ERROR] pg_regress tests failed
2026-10-07 21:55:43 [ERROR] An error occurred. Exit code: 1
2026-10-07 21:55:43 [ERROR] Debug logs:
failed checks.x86_64-linux.psql_orioledb-17 32s
run-check-harness-psql-orioledb-17: 3 of 65 tests failed. ======================= The differences that caused some tests to fail can be viewed in the file "/n …
run-check-harness-psql-orioledb-17:
 3 of 65 tests failed. 
=======================
The differences that caused some tests to fail can be viewed in the
file "/nix/store/kncf67s26s89d4q9kqhrlp8jy3grrmjy-run-check-harness-psql-orioledb-17/regression_output/regression.diffs".  A copy of the test summary that you see
above is saved in the file "/nix/store/kncf67s26s89d4q9kqhrlp8jy3grrmjy-run-check-harness-psql-orioledb-17/regression_output/regression.out".
2026-10-07 21:55:51 [ERROR] pg_regress tests failed
2026-10-07 21:55:51 [ERROR] An error occurred. Exit code: 1
2026-10-07 21:55:51 [ERROR] Debug logs:
failed checks.x86_64-linux.psql_orioledb-17_slim 31s
run-check-harness-psql-orioledb-17-slim: 3 of 65 tests failed. ======================= The differences that caused some tests to fail can be viewed in the fil …
run-check-harness-psql-orioledb-17-slim:
 3 of 65 tests failed. 
=======================
The differences that caused some tests to fail can be viewed in the
file "/nix/store/63p1hc4nj88f91vy9281q45d9ph6n9xx-run-check-harness-psql-orioledb-17-slim/regression_output/regression.diffs".  A copy of the test summary that you see
above is saved in the file "/nix/store/63p1hc4nj88f91vy9281q45d9ph6n9xx-run-check-harness-psql-orioledb-17-slim/regression_output/regression.out".
2026-10-07 21:54:55 [ERROR] pg_regress tests failed
2026-10-07 21:54:55 [ERROR] An error occurred. Exit code: 1
2026-10-07 21:54:55 [ERROR] Debug logs:
20 cancelled
cancelled attributes
status attribute duration
loading…
52 succeeded
succeeded attributes
status attribute duration
loading…
40 already built
skipped attributes
status attribute duration
loading…