nixbot

builds

supabase/postgres build #165 failed

branch develop · PR #2506 · commit 7df5ef42d6 · · took 11m 10s · eval 2m 21s

50 failed
failed attributes
status attribute duration
failed checks.aarch64-linux.ext-amcheck-upgrade 7m 0s
vm-test-run-amcheck-upgrade: cleanup kill machine (pid 9) qemu-system-aarch64: terminating on signal 15 from pid 6 (/nix/store/y88crn50yx35fiiwcjx6xqwi6ahk7mlq- …
vm-test-run-amcheck-upgrade:
cleanup
kill machine (pid 9)
qemu-system-aarch64: terminating on signal 15 from pid 6 (/nix/store/y88crn50yx35fiiwcjx6xqwi6ahk7mlq-python3-3.13.11/bin/python3.13)
vde_switch: EOF data port: Interrupted system call
kill vlan (pid 7)
vde_switch: EOF on stdin, cleaning up and exiting
vde_switch: Caught signal 15, cleaning up and exiting
(finished: cleanup, in 0.01 seconds)
failed checks.aarch64-linux.ext-http 6m 30s
vm-test-run-http: !!! !!! RequestedAssertionFailed: unit "supabase-db-init.service" reached state "failed" cleanup kill machine (pid 9) qemu-system-aarch64: te …
vm-test-run-http:
!!! 
!!! RequestedAssertionFailed: unit "supabase-db-init.service" reached state "failed"
cleanup
kill machine (pid 9)
qemu-system-aarch64: terminating on signal 15 from pid 6 (/nix/store/y88crn50yx35fiiwcjx6xqwi6ahk7mlq-python3-3.13.11/bin/python3.13)
vde_switch: EOF data port: Interrupted system call
kill vlan (pid 7)
vde_switch: Caught signal 15, cleaning up and exiting(finished: cleanup, in 0.01 seconds)
failed checks.aarch64-linux.ext-index_advisor 6m 43s
vm-test-run-index_advisor: !!! RequestedAssertionFailed: unit "supabase-db-init.service" reached state "failed" cleanup kill machine (pid 9) qemu-system-aarch64 …
vm-test-run-index_advisor:
!!! RequestedAssertionFailed: unit "supabase-db-init.service" reached state "failed"
cleanup
kill machine (pid 9)
qemu-system-aarch64: terminating on signal 15 from pid 6 (/nix/store/y88crn50yx35fiiwcjx6xqwi6ahk7mlq-python3-3.13.11/bin/python3.13)
vde_switch: EOF data port: Interrupted system call
kill vlan (pid 7)
(finished: cleanup, in 0.01 seconds)
vde_switch: Caught signal 15, cleaning up and exiting
failed checks.aarch64-linux.ext-orioledb 4m 59s
vm-test-run-orioledb: !!! RequestedAssertionFailed: unit "supabase-db-init.service" reached state "failed" cleanup kill machine (pid 9) qemu-system-aarch64: ter …
vm-test-run-orioledb:
!!! RequestedAssertionFailed: unit "supabase-db-init.service" reached state "failed"
cleanup
kill machine (pid 9)
qemu-system-aarch64: terminating on signal 15 from pid 6 (/nix/store/y88crn50yx35fiiwcjx6xqwi6ahk7mlq-python3-3.13.11/bin/python3.13)
vde_switch: EOF data port: Interrupted system call
kill vlan (pid 7)
(finished: cleanup, in 0.01 seconds)
vde_switch: Caught signal 15, cleaning up and exiting
failed checks.aarch64-linux.ext-pgjwt 8m 50s
vm-test-run-pgjwt: !!! RequestedAssertionFailed: unit "supabase-db-init.service" reached state "failed" cleanup kill machine (pid 9) qemu-system-aarch64: termin …
vm-test-run-pgjwt:
!!! RequestedAssertionFailed: unit "supabase-db-init.service" reached state "failed"
cleanup
kill machine (pid 9)
qemu-system-aarch64: terminating on signal 15 from pid 6 (/nix/store/y88crn50yx35fiiwcjx6xqwi6ahk7mlq-python3-3.13.11/bin/python3.13)
vde_switch: EOF data port: Interrupted system call
kill vlan (pid 7)
(finished: cleanup, in 0.01 seconds)
vde_switch: Caught signal 15, cleaning up and exiting
failed checks.aarch64-linux.ext-pgmq 4m 38s
vm-test-run-pgmq: !!! RequestedAssertionFailed: unit "supabase-db-init.service" reached state "failed" cleanup kill machine (pid 9) qemu-system-aarch64: termina …
vm-test-run-pgmq:
!!! RequestedAssertionFailed: unit "supabase-db-init.service" reached state "failed"
cleanup
kill machine (pid 9)
qemu-system-aarch64: terminating on signal 15 from pid 6 (/nix/store/y88crn50yx35fiiwcjx6xqwi6ahk7mlq-python3-3.13.11/bin/python3.13)
vde_switch: EOF data port: Interrupted system call
kill vlan (pid 7)
vde_switch: Caught signal 15, cleaning up and exiting
(finished: cleanup, in 0.00 seconds)
failed checks.aarch64-linux.ext-pgmq-drop-queue-overload 3m 7s
vm-test-run-pgmq-drop-queue-overload: !!! RequestedAssertionFailed: unit "supabase-db-init.service" reached state "failed" cleanup kill machine (pid 9) qemu-sys …
vm-test-run-pgmq-drop-queue-overload:
!!! RequestedAssertionFailed: unit "supabase-db-init.service" reached state "failed"
cleanup
kill machine (pid 9)
qemu-system-aarch64: terminating on signal 15 from pid 6 (/nix/store/y88crn50yx35fiiwcjx6xqwi6ahk7mlq-python3-3.13.11/bin/python3.13)
vde_switch: EOF data port: Interrupted system call
kill vlan (pid 7)
(finished: cleanup, in 0.01 seconds)
vde_switch: Caught signal 15, cleaning up and exiting
failed checks.aarch64-linux.ext-pg_plan_filter 6m 46s
vm-test-run-plan_filter: !!! RequestedAssertionFailed: unit "supabase-db-init.service" reached state "failed" cleanup kill machine (pid 9) qemu-system-aarch64: …
vm-test-run-plan_filter:
!!! RequestedAssertionFailed: unit "supabase-db-init.service" reached state "failed"
cleanup
kill machine (pid 9)
qemu-system-aarch64: terminating on signal 15 from pid 6 (/nix/store/y88crn50yx35fiiwcjx6xqwi6ahk7mlq-python3-3.13.11/bin/python3.13)
vde_switch: EOF data port: Interrupted system call
kill vlan (pid 7)
(finished: cleanup, in 0.01 seconds)
vde_switch: Caught signal 15, cleaning up and exiting
failed checks.aarch64-linux.ext-pg_repack 9m 55s
vm-test-run-pg_repack: !!! RequestedAssertionFailed: unit "supabase-db-init.service" reached state "failed" cleanup kill machine (pid 9) qemu-system-aarch64: te …
vm-test-run-pg_repack:
!!! RequestedAssertionFailed: unit "supabase-db-init.service" reached state "failed"
cleanup
kill machine (pid 9)
qemu-system-aarch64: terminating on signal 15 from pid 6 (/nix/store/y88crn50yx35fiiwcjx6xqwi6ahk7mlq-python3-3.13.11/bin/python3.13)
vde_switch: EOF data port: Interrupted system call
kill vlan (pid 7)
(finished: cleanup, in 0.00 seconds)
vde_switch: Caught signal 15, cleaning up and exiting
failed checks.aarch64-linux.ext-pgroonga 9m 56s
vm-test-run-pgroonga: !!! RequestedAssertionFailed: unit "supabase-db-init.service" reached state "failed" cleanup kill machine (pid 9) qemu-system-aarch64: ter …
vm-test-run-pgroonga:
!!! RequestedAssertionFailed: unit "supabase-db-init.service" reached state "failed"
cleanup
kill machine (pid 9)
qemu-system-aarch64: terminating on signal 15 from pid 6 (/nix/store/y88crn50yx35fiiwcjx6xqwi6ahk7mlq-python3-3.13.11/bin/python3.13)
vde_switch: EOF data port: Interrupted system call
kill vlan (pid 7)
vde_switch: (finished: cleanup, in 0.00 seconds)
Caught signal 15, cleaning up and exiting
failed checks.aarch64-linux.ext-pgrouting 8m 47s
vm-test-run-pgrouting: !!! RequestedAssertionFailed: unit "supabase-db-init.service" reached state "failed" cleanup kill machine (pid 9) qemu-system-aarch64: te …
vm-test-run-pgrouting:
!!! RequestedAssertionFailed: unit "supabase-db-init.service" reached state "failed"
cleanup
kill machine (pid 9)
qemu-system-aarch64: terminating on signal 15 from pid 6 (/nix/store/y88crn50yx35fiiwcjx6xqwi6ahk7mlq-python3-3.13.11/bin/python3.13)
vde_switch: EOF data port: Interrupted system call
kill vlan (pid 7)
(finished: cleanup, in 0.01 seconds)
vde_switch: Caught signal 15, cleaning up and exiting
failed checks.aarch64-linux.ext-pgsodium 4m 37s
vm-test-run-pgsodium: !!! RequestedAssertionFailed: unit "supabase-db-init.service" reached state "failed" cleanup kill machine (pid 9) qemu-system-aarch64: ter …
vm-test-run-pgsodium:
!!! RequestedAssertionFailed: unit "supabase-db-init.service" reached state "failed"
cleanup
kill machine (pid 9)
qemu-system-aarch64: terminating on signal 15 from pid 6 (/nix/store/y88crn50yx35fiiwcjx6xqwi6ahk7mlq-python3-3.13.11/bin/python3.13)
vde_switch: EOF data port: Interrupted system call
kill vlan (pid 7)
vde_switch: Caught signal 15, cleaning up and exiting
(finished: cleanup, in 0.01 seconds)
failed checks.aarch64-linux.ext-plpgsql_check 4m 37s
vm-test-run-plpgsql_check: !!! RequestedAssertionFailed: unit "supabase-db-init.service" reached state "failed" cleanup kill machine (pid 9) qemu-system-aarch64 …
vm-test-run-plpgsql_check:
!!! RequestedAssertionFailed: unit "supabase-db-init.service" reached state "failed"
cleanup
kill machine (pid 9)
qemu-system-aarch64: terminating on signal 15 from pid 6 (/nix/store/y88crn50yx35fiiwcjx6xqwi6ahk7mlq-python3-3.13.11/bin/python3.13)
vde_switch: EOF data port: Interrupted system call
kill vlan (pid 7)
(finished: cleanup, in 0.01 seconds)
vde_switch: Caught signal 15, cleaning up and exiting
failed checks.aarch64-linux.ext-plv8 3m 9s
vm-test-run-plv8: !!! RequestedAssertionFailed: unit "supabase-db-init.service" reached state "failed" cleanup kill machine (pid 9) qemu-system-aarch64: termina …
vm-test-run-plv8:
!!! RequestedAssertionFailed: unit "supabase-db-init.service" reached state "failed"
cleanup
kill machine (pid 9)
qemu-system-aarch64: terminating on signal 15 from pid 6 (/nix/store/y88crn50yx35fiiwcjx6xqwi6ahk7mlq-python3-3.13.11/bin/python3.13)
vde_switch: EOF data port: Interrupted system call
kill vlan (pid 7)
vde_switch: Caught signal 15, cleaning up and exiting
(finished: cleanup, in 0.01 seconds)
failed checks.aarch64-linux.ext-postgis 8m 47s
vm-test-run-postgis: !!! RequestedAssertionFailed: unit "supabase-db-init.service" reached state "failed" cleanup kill machine (pid 9) qemu-system-aarch64: term …
vm-test-run-postgis:
!!! RequestedAssertionFailed: unit "supabase-db-init.service" reached state "failed"
cleanup
kill machine (pid 9)
qemu-system-aarch64: terminating on signal 15 from pid 6 (/nix/store/y88crn50yx35fiiwcjx6xqwi6ahk7mlq-python3-3.13.11/bin/python3.13)
vde_switch: EOF data port: Interrupted system call
kill vlan (pid 7)
(finished: cleanup, in 0.00 seconds)
vde_switch: Caught signal 15, cleaning up and exiting
failed checks.aarch64-linux.ext-timescaledb 2m 32s
vm-test-run-timescaledb: !!! RequestedAssertionFailed: unit "supabase-db-init.service" reached state "failed" cleanup kill machine (pid 9) qemu-system-aarch64: …
vm-test-run-timescaledb:
!!! RequestedAssertionFailed: unit "supabase-db-init.service" reached state "failed"
cleanup
kill machine (pid 9)
qemu-system-aarch64: terminating on signal 15 from pid 6 (/nix/store/y88crn50yx35fiiwcjx6xqwi6ahk7mlq-python3-3.13.11/bin/python3.13)
vde_switch: EOF data port: Interrupted system call
kill vlan (pid 7)
(finished: cleanup, in 0.01 seconds)
vde_switch: Caught signal 15, cleaning up and exiting
failed checks.aarch64-linux.ext-vault 8m 48s
vm-test-run-supabase_vault: !!! RequestedAssertionFailed: unit "supabase-db-init.service" reached state "failed" cleanup kill machine (pid 9) qemu-system-aarch6 …
vm-test-run-supabase_vault:
!!! RequestedAssertionFailed: unit "supabase-db-init.service" reached state "failed"
cleanup
kill machine (pid 9)
qemu-system-aarch64: terminating on signal 15 from pid 6 (/nix/store/y88crn50yx35fiiwcjx6xqwi6ahk7mlq-python3-3.13.11/bin/python3.13)
vde_switch: EOF data port: Interrupted system call
kill vlan (pid 7)
(finished: cleanup, in 0.01 seconds)
vde_switch: Caught signal 15, cleaning up and exiting
failed checks.aarch64-linux.ext-wrappers-regression-PSQL-1387 2m 25s
vm-test-run-wrappers-regression-PSQL-1387: cleanup kill machine (pid 9) qemu-system-aarch64: terminating on signal 15 from pid 6 (/nix/store/y88crn50yx35fiiwcjx …
vm-test-run-wrappers-regression-PSQL-1387:
cleanup
kill machine (pid 9)
qemu-system-aarch64: terminating on signal 15 from pid 6 (/nix/store/y88crn50yx35fiiwcjx6xqwi6ahk7mlq-python3-3.13.11/bin/python3.13)
vde_switch: EOF data port: Interrupted system call
kill vlan (pid 7)
vde_switch: EOF on stdin, cleaning up and exiting
(finished: cleanup, in 0.00 seconds)
vde_switch: Caught signal 15, cleaning up and exiting
failed checks.aarch64-linux.psql_15 1m 14s
run-check-harness-psql-15: $ pg_isready -h localhost -p 5536 -U supabase_admin -q 2026-10-07 20:43:11 [INFO] PostgreSQL is ready 2026-10-07 20:43:11 [INFO] Load …
run-check-harness-psql-15:
$ pg_isready -h localhost -p 5536 -U supabase_admin -q
2026-10-07 20:43:11 [INFO] PostgreSQL is ready
2026-10-07 20:43:11 [INFO] Loading prime SQL file (full extension set)
$ psql -p 5536 -h localhost --no-password --username=supabase_admin -d postgres -v ON_ERROR_STOP=1 -Xf /nix/store/ij5car617qxa8s7zv27zlhn6gxdnqrlj-prime.sql
psql: error: connection to server at "localhost" (127.0.0.1), port 5536 failed: FATAL:  supautils.extensions_parameter_overrides: invalid json
2026-10-07 20:43:11 [ERROR] Error executing SQL file
2026-10-07 20:43:11 [ERROR] An error occurred. Exit code: 1
2026-10-07 20:43:11 [ERROR] Debug logs:
failed checks.aarch64-linux.psql_15_slim 1m 7s
run-check-harness-psql-15-slim: $ pg_isready -h localhost -p 5539 -U supabase_admin -q 2026-10-07 20:43:12 [INFO] PostgreSQL is ready 2026-10-07 20:43:12 [INFO] …
run-check-harness-psql-15-slim:
$ pg_isready -h localhost -p 5539 -U supabase_admin -q
2026-10-07 20:43:12 [INFO] PostgreSQL is ready
2026-10-07 20:43:12 [INFO] Loading prime SQL file (full extension set)
$ psql -p 5539 -h localhost --no-password --username=supabase_admin -d postgres -v ON_ERROR_STOP=1 -Xf /nix/store/ij5car617qxa8s7zv27zlhn6gxdnqrlj-prime.sql
psql: error: connection to server at "localhost" (127.0.0.1), port 5539 failed: FATAL:  supautils.extensions_parameter_overrides: invalid json
2026-10-07 20:43:12 [ERROR] Error executing SQL file
2026-10-07 20:43:12 [ERROR] An error occurred. Exit code: 1
2026-10-07 20:43:12 [ERROR] Debug logs:
failed checks.aarch64-linux.psql_17 51s
run-check-harness-psql-17: $ pg_isready -h localhost -p 5535 -U supabase_admin -q 2026-10-07 20:42:42 [INFO] PostgreSQL is ready 2026-10-07 20:42:42 [INFO] Load …
run-check-harness-psql-17:
$ pg_isready -h localhost -p 5535 -U supabase_admin -q
2026-10-07 20:42:42 [INFO] PostgreSQL is ready
2026-10-07 20:42:42 [INFO] Loading prime SQL file (full extension set)
$ psql -p 5535 -h localhost --no-password --username=supabase_admin -d postgres -v ON_ERROR_STOP=1 -Xf /nix/store/ij5car617qxa8s7zv27zlhn6gxdnqrlj-prime.sql
psql: error: connection to server at "localhost" (127.0.0.1), port 5535 failed: FATAL:  supautils.extensions_parameter_overrides: invalid json
2026-10-07 20:42:42 [ERROR] Error executing SQL file
2026-10-07 20:42:42 [ERROR] An error occurred. Exit code: 1
2026-10-07 20:42:42 [ERROR] Debug logs:
failed checks.aarch64-linux.psql_17_cli 59s
run-check-harness-psql-17-cli: $ pg_isready -h localhost -p 5541 -U supabase_admin -q 2026-10-07 20:42:51 [INFO] PostgreSQL is ready 2026-10-07 20:42:51 [INFO] …
run-check-harness-psql-17-cli:
$ pg_isready -h localhost -p 5541 -U supabase_admin -q
2026-10-07 20:42:51 [INFO] PostgreSQL is ready
2026-10-07 20:42:51 [INFO] CLI variant detected - loading CLI prime SQL file
$ psql -p 5541 -h localhost --no-password --username=supabase_admin -d postgres -v ON_ERROR_STOP=1 -Xf /nix/store/ib75j74vyc0w374jcz7mqcg6njf21yx3-prime-cli.sql
psql: error: connection to server at "localhost" (127.0.0.1), port 5541 failed: FATAL:  supautils.extensions_parameter_overrides: invalid json
2026-10-07 20:42:51 [ERROR] Error executing CLI prime SQL file
2026-10-07 20:42:51 [ERROR] An error occurred. Exit code: 1
2026-10-07 20:42:51 [ERROR] Debug logs:
failed checks.aarch64-linux.psql_17_slim 42s
run-check-harness-psql-17-slim: $ pg_isready -h localhost -p 5538 -U supabase_admin -q 2026-10-07 20:42:33 [INFO] PostgreSQL is ready 2026-10-07 20:42:33 [INFO] …
run-check-harness-psql-17-slim:
$ pg_isready -h localhost -p 5538 -U supabase_admin -q
2026-10-07 20:42:33 [INFO] PostgreSQL is ready
2026-10-07 20:42:33 [INFO] Loading prime SQL file (full extension set)
$ psql -p 5538 -h localhost --no-password --username=supabase_admin -d postgres -v ON_ERROR_STOP=1 -Xf /nix/store/ij5car617qxa8s7zv27zlhn6gxdnqrlj-prime.sql
psql: error: connection to server at "localhost" (127.0.0.1), port 5538 failed: FATAL:  supautils.extensions_parameter_overrides: invalid json
2026-10-07 20:42:33 [ERROR] Error executing SQL file
2026-10-07 20:42:33 [ERROR] An error occurred. Exit code: 1
2026-10-07 20:42:33 [ERROR] Debug logs:
failed checks.aarch64-linux.psql_orioledb-17 1m 5s
run-check-harness-psql-orioledb-17: $ psql -p 5537 -h localhost --no-password --username=supabase_admin -d postgres -c CREATE EXTENSION IF NOT EXISTS orioledb; …
run-check-harness-psql-orioledb-17:
$ psql -p 5537 -h localhost --no-password --username=supabase_admin -d postgres -c CREATE EXTENSION IF NOT EXISTS orioledb;
psql: error: connection to server at "localhost" (127.0.0.1), port 5537 failed: FATAL:  supautils.extensions_parameter_overrides: invalid json
2026-10-07 20:43:23 [INFO] Loading prime SQL file (full extension set)
$ psql -p 5537 -h localhost --no-password --username=supabase_admin -d postgres -v ON_ERROR_STOP=1 -Xf /nix/store/ij5car617qxa8s7zv27zlhn6gxdnqrlj-prime.sql
psql: error: connection to server at "localhost" (127.0.0.1), port 5537 failed: FATAL:  supautils.extensions_parameter_overrides: invalid json
2026-10-07 20:43:23 [ERROR] Error executing SQL file
2026-10-07 20:43:23 [ERROR] An error occurred. Exit code: 1
2026-10-07 20:43:23 [ERROR] Debug logs:
failed checks.aarch64-linux.psql_orioledb-17_slim 42s
run-check-harness-psql-orioledb-17-slim: $ psql -p 5540 -h localhost --no-password --username=supabase_admin -d postgres -c CREATE EXTENSION IF NOT EXISTS oriol …
run-check-harness-psql-orioledb-17-slim:
$ psql -p 5540 -h localhost --no-password --username=supabase_admin -d postgres -c CREATE EXTENSION IF NOT EXISTS orioledb;
psql: error: connection to server at "localhost" (127.0.0.1), port 5540 failed: FATAL:  supautils.extensions_parameter_overrides: invalid json
2026-10-07 20:42:36 [INFO] Loading prime SQL file (full extension set)
$ psql -p 5540 -h localhost --no-password --username=supabase_admin -d postgres -v ON_ERROR_STOP=1 -Xf /nix/store/ij5car617qxa8s7zv27zlhn6gxdnqrlj-prime.sql
psql: error: connection to server at "localhost" (127.0.0.1), port 5540 failed: FATAL:  supautils.extensions_parameter_overrides: invalid json
2026-10-07 20:42:36 [ERROR] Error executing SQL file
2026-10-07 20:42:36 [ERROR] An error occurred. Exit code: 1
2026-10-07 20:42:36 [ERROR] Debug logs:
failed checks.x86_64-linux.ext-amcheck-upgrade 1m 12s
vm-test-run-amcheck-upgrade: cleanup kill machine (pid 9) qemu-system-x86_64: terminating on signal 15 from pid 6 (/nix/store/qzc04a3npl70cyyy6flnnrb2ig3kayxm-p …
vm-test-run-amcheck-upgrade:
cleanup
kill machine (pid 9)
qemu-system-x86_64: terminating on signal 15 from pid 6 (/nix/store/qzc04a3npl70cyyy6flnnrb2ig3kayxm-python3-3.13.11/bin/python3.13)
vde_switch: EOF data port: Interrupted system call
kill vlan (pid 7)
vde_switch: EOF on stdin, cleaning up and exiting
vde_switch: Caught signal 15, cleaning up and exiting
(finished: cleanup, in 0.01 seconds)
failed checks.x86_64-linux.ext-http 1m 17s
vm-test-run-http: cleanup kill machine (pid 9) qemu-system-x86_64: terminating on signal 15 from pid 6 (/nix/store/qzc04a3npl70cyyy6flnnrb2ig3kayxm-python3-3.13 …
vm-test-run-http:
cleanup
kill machine (pid 9)
qemu-system-x86_64: terminating on signal 15 from pid 6 (/nix/store/qzc04a3npl70cyyy6flnnrb2ig3kayxm-python3-3.13.11/bin/python3.13)
vde_switch: EOF data port: Interrupted system call
kill vlan (pid 7)
vde_switch: EOF on stdin, cleaning up and exiting
vde_switch: Caught signal 15, cleaning up and exiting
(finished: cleanup, in 0.00 seconds)
failed checks.x86_64-linux.ext-index_advisor 59s
vm-test-run-index_advisor: !!! RequestedAssertionFailed: unit "supabase-db-init.service" reached state "failed" cleanup kill machine (pid 9) qemu-system-x86_64: …
vm-test-run-index_advisor:
!!! RequestedAssertionFailed: unit "supabase-db-init.service" reached state "failed"
cleanup
kill machine (pid 9)
qemu-system-x86_64: terminating on signal 15 from pid 6 (/nix/store/qzc04a3npl70cyyy6flnnrb2ig3kayxm-python3-3.13.11/bin/python3.13)
vde_switch: EOF data port: Interrupted system call
kill vlan (pid 7)
(finished: cleanup, in 0.01 seconds)
vde_switch: Caught signal 15, cleaning up and exiting
failed checks.x86_64-linux.ext-orioledb 1m 1s
vm-test-run-orioledb: !!! RequestedAssertionFailed: unit "supabase-db-init.service" reached state "failed" cleanup kill machine (pid 9) qemu-system-x86_64: term …
vm-test-run-orioledb:
!!! RequestedAssertionFailed: unit "supabase-db-init.service" reached state "failed"
cleanup
kill machine (pid 9)
qemu-system-x86_64: terminating on signal 15 from pid 6 (/nix/store/qzc04a3npl70cyyy6flnnrb2ig3kayxm-python3-3.13.11/bin/python3.13)
vde_switch: EOF data port: Interrupted system call
kill vlan (pid 7)
(finished: cleanup, in 0.01 seconds)
vde_switch: Caught signal 15, cleaning up and exiting
failed checks.x86_64-linux.ext-pgjwt 55s
vm-test-run-pgjwt: !!! RequestedAssertionFailed: unit "supabase-db-init.service" reached state "failed" cleanup kill machine (pid 9) qemu-system-x86_64: termina …
vm-test-run-pgjwt:
!!! RequestedAssertionFailed: unit "supabase-db-init.service" reached state "failed"
cleanup
kill machine (pid 9)
qemu-system-x86_64: terminating on signal 15 from pid 6 (/nix/store/qzc04a3npl70cyyy6flnnrb2ig3kayxm-python3-3.13.11/bin/python3.13)
vde_switch: EOF data port: Interrupted system call
kill vlan (pid 7)
vde_switch: Caught signal 15, cleaning up and exiting
(finished: cleanup, in 0.01 seconds)
failed checks.x86_64-linux.ext-pgmq 37s
vm-test-run-pgmq: !!! RequestedAssertionFailed: unit "supabase-db-init.service" reached state "failed" cleanup kill machine (pid 9) qemu-system-x86_64: terminat …
vm-test-run-pgmq:
!!! RequestedAssertionFailed: unit "supabase-db-init.service" reached state "failed"
cleanup
kill machine (pid 9)
qemu-system-x86_64: terminating on signal 15 from pid 6 (/nix/store/qzc04a3npl70cyyy6flnnrb2ig3kayxm-python3-3.13.11/bin/python3.13)
vde_switch: EOF data port: Interrupted system call
kill vlan (pid 7)
(finished: cleanup, in 0.00 seconds)
vde_switch: Caught signal 15, cleaning up and exiting
failed checks.x86_64-linux.ext-pgmq-drop-queue-overload 1m 1s
vm-test-run-pgmq-drop-queue-overload: !!! RequestedAssertionFailed: unit "supabase-db-init.service" reached state "failed" cleanup kill machine (pid 9) qemu-sys …
vm-test-run-pgmq-drop-queue-overload:
!!! RequestedAssertionFailed: unit "supabase-db-init.service" reached state "failed"
cleanup
kill machine (pid 9)
qemu-system-x86_64: terminating on signal 15 from pid 6 (/nix/store/qzc04a3npl70cyyy6flnnrb2ig3kayxm-python3-3.13.11/bin/python3.13)
vde_switch: EOF data port: Interrupted system call
kill vlan (pid 7)
(finished: cleanup, in 0.00 seconds)
vde_switch: Caught signal 15, cleaning up and exiting
failed checks.x86_64-linux.ext-pg_plan_filter 59s
vm-test-run-plan_filter: !!! RequestedAssertionFailed: unit "supabase-db-init.service" reached state "failed" cleanup kill machine (pid 9) qemu-system-x86_64: t …
vm-test-run-plan_filter:
!!! RequestedAssertionFailed: unit "supabase-db-init.service" reached state "failed"
cleanup
kill machine (pid 9)
qemu-system-x86_64: terminating on signal 15 from pid 6 (/nix/store/qzc04a3npl70cyyy6flnnrb2ig3kayxm-python3-3.13.11/bin/python3.13)
vde_switch: EOF data port: Interrupted system call
kill vlan (pid 7)
(finished: cleanup, in 0.01 seconds)
vde_switch: Caught signal 15, cleaning up and exiting
failed checks.x86_64-linux.ext-pg_repack 59s
vm-test-run-pg_repack: !!! !!! RequestedAssertionFailed: unit "supabase-db-init.service" reached state "failed" cleanup kill machine (pid 9) qemu-system-x86_64 …
vm-test-run-pg_repack:
!!! 
!!! RequestedAssertionFailed: unit "supabase-db-init.service" reached state "failed"
cleanup
kill machine (pid 9)
qemu-system-x86_64: terminating on signal 15 from pid 6 (/nix/store/qzc04a3npl70cyyy6flnnrb2ig3kayxm-python3-3.13.11/bin/python3.13)
kill vlan (pid 7)
vde_switch: (finished: cleanup, in 0.01 seconds)
Caught signal 15, cleaning up and exiting
failed checks.x86_64-linux.ext-pgroonga 1m 14s
vm-test-run-pgroonga: !!! RequestedAssertionFailed: unit "supabase-db-init.service" reached state "failed" cleanup kill machine (pid 9) qemu-system-x86_64: term …
vm-test-run-pgroonga:
!!! RequestedAssertionFailed: unit "supabase-db-init.service" reached state "failed"
cleanup
kill machine (pid 9)
qemu-system-x86_64: terminating on signal 15 from pid 6 (/nix/store/qzc04a3npl70cyyy6flnnrb2ig3kayxm-python3-3.13.11/bin/python3.13)
vde_switch: EOF data port: Interrupted system call
kill vlan (pid 7)
(finished: cleanup, in 0.01 seconds)
vde_switch: Caught signal 15, cleaning up and exiting
failed checks.x86_64-linux.ext-pgrouting 53s
vm-test-run-pgrouting: cleanup kill machine (pid 9) qemu-system-x86_64: terminating on signal 15 from pid 6 (/nix/store/qzc04a3npl70cyyy6flnnrb2ig3kayxm-python3 …
vm-test-run-pgrouting:
cleanup
kill machine (pid 9)
qemu-system-x86_64: terminating on signal 15 from pid 6 (/nix/store/qzc04a3npl70cyyy6flnnrb2ig3kayxm-python3-3.13.11/bin/python3.13)
vde_switch: EOF data port: Interrupted system call
kill vlan (pid 7)
vde_switch: EOF on stdin, cleaning up and exiting
vde_switch: Caught signal 15, cleaning up and exiting
(finished: cleanup, in 0.01 seconds)
failed checks.x86_64-linux.ext-pgsodium 24s
vm-test-run-pgsodium: !!! RequestedAssertionFailed: unit "supabase-db-init.service" reached state "failed" cleanup kill machine (pid 9) qemu-system-x86_64: term …
vm-test-run-pgsodium:
!!! RequestedAssertionFailed: unit "supabase-db-init.service" reached state "failed"
cleanup
kill machine (pid 9)
qemu-system-x86_64: terminating on signal 15 from pid 6 (/nix/store/qzc04a3npl70cyyy6flnnrb2ig3kayxm-python3-3.13.11/bin/python3.13)
vde_switch: EOF data port: Interrupted system call
kill vlan (pid 7)
(finished: cleanup, in 0.00 seconds)
vde_switch: Caught signal 15, cleaning up and exiting
failed checks.x86_64-linux.ext-plpgsql_check 21s
vm-test-run-plpgsql_check: !!! RequestedAssertionFailed: unit "supabase-db-init.service" reached state "failed" cleanup kill machine (pid 9) qemu-system-x86_64: …
vm-test-run-plpgsql_check:
!!! RequestedAssertionFailed: unit "supabase-db-init.service" reached state "failed"
cleanup
kill machine (pid 9)
qemu-system-x86_64: terminating on signal 15 from pid 6 (/nix/store/qzc04a3npl70cyyy6flnnrb2ig3kayxm-python3-3.13.11/bin/python3.13)
vde_switch: EOF data port: Interrupted system call
kill vlan (pid 7)
(finished: cleanup, in 0.00 seconds)
vde_switch: Caught signal 15, cleaning up and exiting
failed checks.x86_64-linux.ext-plv8 1m 2s
vm-test-run-plv8: cleanup kill machine (pid 9) qemu-system-x86_64: terminating on signal 15 from pid 6 (/nix/store/qzc04a3npl70cyyy6flnnrb2ig3kayxm-python3-3.13 …
vm-test-run-plv8:
cleanup
kill machine (pid 9)
qemu-system-x86_64: terminating on signal 15 from pid 6 (/nix/store/qzc04a3npl70cyyy6flnnrb2ig3kayxm-python3-3.13.11/bin/python3.13)
vde_switch: EOF data port: Interrupted system call
kill vlan (pid 7)
vde_switch: EOF on stdin, cleaning up and exiting
vde_switch: Caught signal 15, cleaning up and exiting
(finished: cleanup, in 0.01 seconds)
failed checks.x86_64-linux.ext-postgis 21s
vm-test-run-postgis: !!! RequestedAssertionFailed: unit "supabase-db-init.service" reached state "failed" cleanup kill machine (pid 9) qemu-system-x86_64: termi …
vm-test-run-postgis:
!!! RequestedAssertionFailed: unit "supabase-db-init.service" reached state "failed"
cleanup
kill machine (pid 9)
qemu-system-x86_64: terminating on signal 15 from pid 6 (/nix/store/qzc04a3npl70cyyy6flnnrb2ig3kayxm-python3-3.13.11/bin/python3.13)
vde_switch: EOF data port: Interrupted system call
kill vlan (pid 7)
(finished: cleanup, in 0.00 seconds)
vde_switch: Caught signal 15, cleaning up and exiting
failed checks.x86_64-linux.ext-timescaledb 56s
vm-test-run-timescaledb: cleanup kill machine (pid 9) qemu-system-x86_64: terminating on signal 15 from pid 6 (/nix/store/qzc04a3npl70cyyy6flnnrb2ig3kayxm-pytho …
vm-test-run-timescaledb:
cleanup
kill machine (pid 9)
qemu-system-x86_64: terminating on signal 15 from pid 6 (/nix/store/qzc04a3npl70cyyy6flnnrb2ig3kayxm-python3-3.13.11/bin/python3.13)
vde_switch: EOF data port: Interrupted system call
kill vlan (pid 7)
vde_switch: EOF on stdin, cleaning up and exiting
vde_switch: Caught signal 15, cleaning up and exiting
(finished: cleanup, in 0.01 seconds)
failed checks.x86_64-linux.ext-vault 21s
vm-test-run-supabase_vault: cleanup kill machine (pid 9) qemu-system-x86_64: terminating on signal 15 from pid 6 (/nix/store/qzc04a3npl70cyyy6flnnrb2ig3kayxm-py …
vm-test-run-supabase_vault:
cleanup
kill machine (pid 9)
qemu-system-x86_64: terminating on signal 15 from pid 6 (/nix/store/qzc04a3npl70cyyy6flnnrb2ig3kayxm-python3-3.13.11/bin/python3.13)
vde_switch: EOF data port: Interrupted system call
kill vlan (pid 7)
vde_switch: EOF on stdin, cleaning up and exiting
vde_switch: Caught signal 15, cleaning up and exiting
(finished: cleanup, in 0.01 seconds)
failed checks.x86_64-linux.ext-wrappers-regression-PSQL-1387 21s
vm-test-run-wrappers-regression-PSQL-1387: !!! RequestedAssertionFailed: unit "supabase-db-init.service" reached state "failed" cleanup kill machine (pid 9) qem …
vm-test-run-wrappers-regression-PSQL-1387:
!!! RequestedAssertionFailed: unit "supabase-db-init.service" reached state "failed"
cleanup
kill machine (pid 9)
qemu-system-x86_64: terminating on signal 15 from pid 6 (/nix/store/qzc04a3npl70cyyy6flnnrb2ig3kayxm-python3-3.13.11/bin/python3.13)
vde_switch: EOF data port: Interrupted system call
kill vlan (pid 7)
vde_switch: Caught signal 15, cleaning up and exiting
(finished: cleanup, in 0.00 seconds)
failed checks.x86_64-linux.psql_15 49s
run-check-harness-psql-15: $ pg_isready -h localhost -p 5536 -U supabase_admin -q 2026-10-07 20:44:01 [INFO] PostgreSQL is ready 2026-10-07 20:44:01 [INFO] Load …
run-check-harness-psql-15:
$ pg_isready -h localhost -p 5536 -U supabase_admin -q
2026-10-07 20:44:01 [INFO] PostgreSQL is ready
2026-10-07 20:44:01 [INFO] Loading prime SQL file (full extension set)
$ psql -p 5536 -h localhost --no-password --username=supabase_admin -d postgres -v ON_ERROR_STOP=1 -Xf /nix/store/ij5car617qxa8s7zv27zlhn6gxdnqrlj-prime.sql
psql: error: connection to server at "localhost" (127.0.0.1), port 5536 failed: FATAL:  supautils.extensions_parameter_overrides: invalid json
2026-10-07 20:44:01 [ERROR] Error executing SQL file
2026-10-07 20:44:01 [ERROR] An error occurred. Exit code: 1
2026-10-07 20:44:01 [ERROR] Debug logs:
failed checks.x86_64-linux.psql_15_slim 47s
run-check-harness-psql-15-slim: $ pg_isready -h localhost -p 5539 -U supabase_admin -q 2026-10-07 20:44:35 [INFO] PostgreSQL is ready 2026-10-07 20:44:35 [INFO] …
run-check-harness-psql-15-slim:
$ pg_isready -h localhost -p 5539 -U supabase_admin -q
2026-10-07 20:44:35 [INFO] PostgreSQL is ready
2026-10-07 20:44:35 [INFO] Loading prime SQL file (full extension set)
$ psql -p 5539 -h localhost --no-password --username=supabase_admin -d postgres -v ON_ERROR_STOP=1 -Xf /nix/store/ij5car617qxa8s7zv27zlhn6gxdnqrlj-prime.sql
psql: error: connection to server at "localhost" (127.0.0.1), port 5539 failed: FATAL:  supautils.extensions_parameter_overrides: invalid json
2026-10-07 20:44:35 [ERROR] Error executing SQL file
2026-10-07 20:44:35 [ERROR] An error occurred. Exit code: 1
2026-10-07 20:44:35 [ERROR] Debug logs:
failed checks.x86_64-linux.psql_17 32s
run-check-harness-psql-17: $ pg_isready -h localhost -p 5535 -U supabase_admin -q 2026-10-07 20:44:20 [INFO] PostgreSQL is ready 2026-10-07 20:44:20 [INFO] Load …
run-check-harness-psql-17:
$ pg_isready -h localhost -p 5535 -U supabase_admin -q
2026-10-07 20:44:20 [INFO] PostgreSQL is ready
2026-10-07 20:44:20 [INFO] Loading prime SQL file (full extension set)
$ psql -p 5535 -h localhost --no-password --username=supabase_admin -d postgres -v ON_ERROR_STOP=1 -Xf /nix/store/ij5car617qxa8s7zv27zlhn6gxdnqrlj-prime.sql
psql: error: connection to server at "localhost" (127.0.0.1), port 5535 failed: FATAL:  supautils.extensions_parameter_overrides: invalid json
2026-10-07 20:44:20 [ERROR] Error executing SQL file
2026-10-07 20:44:20 [ERROR] An error occurred. Exit code: 1
2026-10-07 20:44:20 [ERROR] Debug logs:
failed checks.x86_64-linux.psql_17_cli 14s
run-check-harness-psql-17-cli: $ pg_isready -h localhost -p 5541 -U supabase_admin -q 2026-10-07 20:43:38 [INFO] PostgreSQL is ready 2026-10-07 20:43:38 [INFO] …
run-check-harness-psql-17-cli:
$ pg_isready -h localhost -p 5541 -U supabase_admin -q
2026-10-07 20:43:38 [INFO] PostgreSQL is ready
2026-10-07 20:43:38 [INFO] CLI variant detected - loading CLI prime SQL file
$ psql -p 5541 -h localhost --no-password --username=supabase_admin -d postgres -v ON_ERROR_STOP=1 -Xf /nix/store/ib75j74vyc0w374jcz7mqcg6njf21yx3-prime-cli.sql
psql: error: connection to server at "localhost" (127.0.0.1), port 5541 failed: FATAL:  supautils.extensions_parameter_overrides: invalid json
2026-10-07 20:43:38 [ERROR] Error executing CLI prime SQL file
2026-10-07 20:43:38 [ERROR] An error occurred. Exit code: 1
2026-10-07 20:43:38 [ERROR] Debug logs:
failed checks.x86_64-linux.psql_17_slim 32s
run-check-harness-psql-17-slim: $ pg_isready -h localhost -p 5538 -U supabase_admin -q 2026-10-07 20:44:02 [INFO] PostgreSQL is ready 2026-10-07 20:44:02 [INFO] …
run-check-harness-psql-17-slim:
$ pg_isready -h localhost -p 5538 -U supabase_admin -q
2026-10-07 20:44:02 [INFO] PostgreSQL is ready
2026-10-07 20:44:02 [INFO] Loading prime SQL file (full extension set)
$ psql -p 5538 -h localhost --no-password --username=supabase_admin -d postgres -v ON_ERROR_STOP=1 -Xf /nix/store/ij5car617qxa8s7zv27zlhn6gxdnqrlj-prime.sql
psql: error: connection to server at "localhost" (127.0.0.1), port 5538 failed: FATAL:  supautils.extensions_parameter_overrides: invalid json
2026-10-07 20:44:02 [ERROR] Error executing SQL file
2026-10-07 20:44:02 [ERROR] An error occurred. Exit code: 1
2026-10-07 20:44:02 [ERROR] Debug logs:
failed checks.x86_64-linux.psql_orioledb-17 32s
run-check-harness-psql-orioledb-17: $ psql -p 5537 -h localhost --no-password --username=supabase_admin -d postgres -c CREATE EXTENSION IF NOT EXISTS orioledb; …
run-check-harness-psql-orioledb-17:
$ psql -p 5537 -h localhost --no-password --username=supabase_admin -d postgres -c CREATE EXTENSION IF NOT EXISTS orioledb;
psql: error: connection to server at "localhost" (127.0.0.1), port 5537 failed: FATAL:  supautils.extensions_parameter_overrides: invalid json
2026-10-07 20:43:57 [INFO] Loading prime SQL file (full extension set)
$ psql -p 5537 -h localhost --no-password --username=supabase_admin -d postgres -v ON_ERROR_STOP=1 -Xf /nix/store/ij5car617qxa8s7zv27zlhn6gxdnqrlj-prime.sql
psql: error: connection to server at "localhost" (127.0.0.1), port 5537 failed: FATAL:  supautils.extensions_parameter_overrides: invalid json
2026-10-07 20:43:57 [ERROR] Error executing SQL file
2026-10-07 20:43:57 [ERROR] An error occurred. Exit code: 1
2026-10-07 20:43:57 [ERROR] Debug logs:
failed checks.x86_64-linux.psql_orioledb-17_slim 33s
run-check-harness-psql-orioledb-17-slim: $ psql -p 5540 -h localhost --no-password --username=supabase_admin -d postgres -c CREATE EXTENSION IF NOT EXISTS oriol …
run-check-harness-psql-orioledb-17-slim:
$ psql -p 5540 -h localhost --no-password --username=supabase_admin -d postgres -c CREATE EXTENSION IF NOT EXISTS orioledb;
psql: error: connection to server at "localhost" (127.0.0.1), port 5540 failed: FATAL:  supautils.extensions_parameter_overrides: invalid json
2026-10-07 20:44:04 [INFO] Loading prime SQL file (full extension set)
$ psql -p 5540 -h localhost --no-password --username=supabase_admin -d postgres -v ON_ERROR_STOP=1 -Xf /nix/store/ij5car617qxa8s7zv27zlhn6gxdnqrlj-prime.sql
psql: error: connection to server at "localhost" (127.0.0.1), port 5540 failed: FATAL:  supautils.extensions_parameter_overrides: invalid json
2026-10-07 20:44:04 [ERROR] Error executing SQL file
2026-10-07 20:44:04 [ERROR] An error occurred. Exit code: 1
2026-10-07 20:44:04 [ERROR] Debug logs:
6 succeeded
succeeded attributes
status attribute duration
loading…
68 already built
skipped attributes
status attribute duration
loading…