these 3 derivations will be built: /nix/store/x8d5wzrx1jmkgxxkjxxa1hap06qq8wvq-start-postgres-server-test.drv /nix/store/rxmvp1idz2wmv1sanacy9lpm7sqxymyc-postgres-15-check-harness.drv /nix/store/f32kyxfdv38vylqrxa46lsnm8f7yingv-run-check-harness-psql-15-slim.drv error: Cannot build '/nix/store/f32kyxfdv38vylqrxa46lsnm8f7yingv-run-check-harness-psql-15-slim.drv'. Reason: builder failed with exit code 1. Output paths: /nix/store/vi8a4kjhgscr0bg0d8jn7bjp47c36cg0-run-check-harness-psql-15-slim Last 25 log lines: > test supautils_restrict_versions ... ok 83 ms > test vault ... ok 30 ms > test wal2json ... ok 15 ms > test z_15_ext_interface ... FAILED 684 ms > test z_15_intarray_ltree_query ... ok 11 ms > test z_15_pg_stat_monitor ... ok 11 ms > test z_15_pgjwt ... ok 19 ms > test z_15_pgvector ... ok 31 ms > test z_15_plv8 ... ok 52 ms > test z_15_roles ... ok 18 ms > test z_15_rum ... ok 18 ms > test z_15_timescale ... ok 25 ms > test z_15_unhype_timescale_to_partman ... ok 11945 ms > > ======================= > 2 of 72 tests failed. > ======================= > > The differences that caused some tests to fail can be viewed in the > file "/nix/store/vi8a4kjhgscr0bg0d8jn7bjp47c36cg0-run-check-harness-psql-15-slim/regression_output/regression.diffs". A copy of the test summary that you see > above is saved in the file "/nix/store/vi8a4kjhgscr0bg0d8jn7bjp47c36cg0-run-check-harness-psql-15-slim/regression_output/regression.out". > > 2026-10-08 00:10:31 [ERROR] pg_regress tests failed > 2026-10-08 00:10:31 [ERROR] An error occurred. Exit code: 1 > 2026-10-08 00:10:31 [ERROR] Debug logs: For full logs, run: nix log /nix/store/f32kyxfdv38vylqrxa46lsnm8f7yingv-run-check-harness-psql-15-slim.drv