nixbot

builds
1this derivation will be built:2 /nix/store/yc01qj5avg2y3l8zqz0argyp5k047hbb-run-check-harness-psql-17.drv3this path will be fetched (4.5 KiB download, 16.1 KiB unpacked):4 /nix/store/j7fs5vxabpxy3lkr626j4fv23hd7rkgf-postgres-17-check-harness5error: Cannot build '/nix/store/yc01qj5avg2y3l8zqz0argyp5k047hbb-run-check-harness-psql-17.drv'.6 Reason: builder failed with exit code 1.7 Output paths:8 /nix/store/jcgk6mn417qxj0m4whbr1q5br7a2ivqw-run-check-harness-psql-179 Last 25 log lines:10 > test roles ... ok 12 ms11 > test security ... ok 11 ms12 > test storage ... ok 22 ms13 > test supautils_reserved_roles ... ok 11 ms14 > test supautils_restrict_versions ... ok 106 ms15 > test vault ... ok 31 ms16 > test wal2json ... ok 14 ms17 > test z_17_ext_interface ... FAILED 116 ms18 > test z_17_intarray_ltree_query ... ok 13 ms19 > test z_17_pg_stat_monitor ... ok 8 ms20 > test z_17_pgvector ... ok 14 ms21 > test z_17_roles ... ok 16 ms22 > test z_17_rum ... ok 18 ms23 >24 > =======================25 > 2 of 68 tests failed.26 > =======================27 >28 > The differences that caused some tests to fail can be viewed in the29 > file "/nix/store/jcgk6mn417qxj0m4whbr1q5br7a2ivqw-run-check-harness-psql-17/regression_output/regression.diffs". A copy of the test summary that you see30 > above is saved in the file "/nix/store/jcgk6mn417qxj0m4whbr1q5br7a2ivqw-run-check-harness-psql-17/regression_output/regression.out".31 >32 > 2026-10-07 23:26:30 [ERROR] pg_regress tests failed33 > 2026-10-07 23:26:30 [ERROR] An error occurred. Exit code: 134 > 2026-10-07 23:26:30 [ERROR] Debug logs:35 For full logs, run:36 nix log /nix/store/yc01qj5avg2y3l8zqz0argyp5k047hbb-run-check-harness-psql-17.drv