this derivation will be built: /nix/store/yc01qj5avg2y3l8zqz0argyp5k047hbb-run-check-harness-psql-17.drv this path will be fetched (4.5 KiB download, 16.1 KiB unpacked): /nix/store/j7fs5vxabpxy3lkr626j4fv23hd7rkgf-postgres-17-check-harness error: Cannot build '/nix/store/yc01qj5avg2y3l8zqz0argyp5k047hbb-run-check-harness-psql-17.drv'. Reason: builder failed with exit code 1. Output paths: /nix/store/jcgk6mn417qxj0m4whbr1q5br7a2ivqw-run-check-harness-psql-17 Last 25 log lines: > test roles ... ok 12 ms > test security ... ok 11 ms > test storage ... ok 22 ms > test supautils_reserved_roles ... ok 11 ms > test supautils_restrict_versions ... ok 106 ms > test vault ... ok 31 ms > test wal2json ... ok 14 ms > test z_17_ext_interface ... FAILED 116 ms > test z_17_intarray_ltree_query ... ok 13 ms > test z_17_pg_stat_monitor ... ok 8 ms > test z_17_pgvector ... ok 14 ms > test z_17_roles ... ok 16 ms > test z_17_rum ... ok 18 ms > > ======================= > 2 of 68 tests failed. > ======================= > > The differences that caused some tests to fail can be viewed in the > file "/nix/store/jcgk6mn417qxj0m4whbr1q5br7a2ivqw-run-check-harness-psql-17/regression_output/regression.diffs". A copy of the test summary that you see > above is saved in the file "/nix/store/jcgk6mn417qxj0m4whbr1q5br7a2ivqw-run-check-harness-psql-17/regression_output/regression.out". > > 2026-10-07 23:26:30 [ERROR] pg_regress tests failed > 2026-10-07 23:26:30 [ERROR] An error occurred. Exit code: 1 > 2026-10-07 23:26:30 [ERROR] Debug logs: For full logs, run: nix log /nix/store/yc01qj5avg2y3l8zqz0argyp5k047hbb-run-check-harness-psql-17.drv