nixbot

builds
1this derivation will be built:2 /nix/store/33mlphad4ykcks31r3chzajp10ls282v-run-check-harness-psql-15-slim.drv3this path will be fetched (4.5 KiB download, 16.2 KiB unpacked):4 /nix/store/jxc17y83dl7fpzib0yz071l2z1fgl2sd-postgres-15-check-harness5error: Cannot build '/nix/store/33mlphad4ykcks31r3chzajp10ls282v-run-check-harness-psql-15-slim.drv'.6 Reason: builder failed with exit code 1.7 Output paths:8 /nix/store/5sii00imv410hd3j6spjp0h5ahl5fs4m-run-check-harness-psql-15-slim9 Last 25 log lines:10 > test supautils_restrict_versions ... ok 84 ms11 > test vault ... ok 29 ms12 > test wal2json ... ok 14 ms13 > test z_15_ext_interface ... FAILED 620 ms14 > test z_15_intarray_ltree_query ... ok 11 ms15 > test z_15_pg_stat_monitor ... ok 11 ms16 > test z_15_pgjwt ... ok 17 ms17 > test z_15_pgvector ... ok 33 ms18 > test z_15_plv8 ... ok 49 ms19 > test z_15_roles ... ok 17 ms20 > test z_15_rum ... ok 18 ms21 > test z_15_timescale ... ok 23 ms22 > test z_15_unhype_timescale_to_partman ... ok 11340 ms23 >24 > =======================25 > 2 of 72 tests failed.26 > =======================27 >28 > The differences that caused some tests to fail can be viewed in the29 > file "/nix/store/5sii00imv410hd3j6spjp0h5ahl5fs4m-run-check-harness-psql-15-slim/regression_output/regression.diffs". A copy of the test summary that you see30 > above is saved in the file "/nix/store/5sii00imv410hd3j6spjp0h5ahl5fs4m-run-check-harness-psql-15-slim/regression_output/regression.out".31 >32 > 2026-10-07 23:27:29 [ERROR] pg_regress tests failed33 > 2026-10-07 23:27:29 [ERROR] An error occurred. Exit code: 134 > 2026-10-07 23:27:29 [ERROR] Debug logs:35 For full logs, run:36 nix log /nix/store/33mlphad4ykcks31r3chzajp10ls282v-run-check-harness-psql-15-slim.drv