this derivation will be built: /nix/store/33mlphad4ykcks31r3chzajp10ls282v-run-check-harness-psql-15-slim.drv this path will be fetched (4.5 KiB download, 16.2 KiB unpacked): /nix/store/jxc17y83dl7fpzib0yz071l2z1fgl2sd-postgres-15-check-harness error: Cannot build '/nix/store/33mlphad4ykcks31r3chzajp10ls282v-run-check-harness-psql-15-slim.drv'. Reason: builder failed with exit code 1. Output paths: /nix/store/5sii00imv410hd3j6spjp0h5ahl5fs4m-run-check-harness-psql-15-slim Last 25 log lines: > test supautils_restrict_versions ... ok 84 ms > test vault ... ok 29 ms > test wal2json ... ok 14 ms > test z_15_ext_interface ... FAILED 620 ms > test z_15_intarray_ltree_query ... ok 11 ms > test z_15_pg_stat_monitor ... ok 11 ms > test z_15_pgjwt ... ok 17 ms > test z_15_pgvector ... ok 33 ms > test z_15_plv8 ... ok 49 ms > test z_15_roles ... ok 17 ms > test z_15_rum ... ok 18 ms > test z_15_timescale ... ok 23 ms > test z_15_unhype_timescale_to_partman ... ok 11340 ms > > ======================= > 2 of 72 tests failed. > ======================= > > The differences that caused some tests to fail can be viewed in the > file "/nix/store/5sii00imv410hd3j6spjp0h5ahl5fs4m-run-check-harness-psql-15-slim/regression_output/regression.diffs". A copy of the test summary that you see > above is saved in the file "/nix/store/5sii00imv410hd3j6spjp0h5ahl5fs4m-run-check-harness-psql-15-slim/regression_output/regression.out". > > 2026-10-07 23:27:29 [ERROR] pg_regress tests failed > 2026-10-07 23:27:29 [ERROR] An error occurred. Exit code: 1 > 2026-10-07 23:27:29 [ERROR] Debug logs: For full logs, run: nix log /nix/store/33mlphad4ykcks31r3chzajp10ls282v-run-check-harness-psql-15-slim.drv