nixbot

builds
1this derivation will be built:2 /nix/store/mkm79sly7cprcs8wl0rq4icyhrpw21sp-run-check-harness-psql-15.drv3this path will be fetched (4.5 KiB download, 16.2 KiB unpacked):4 /nix/store/di0giz2qyy74pd4s3f23lxpqspadjzdi-postgres-15-check-harness5error: Cannot build '/nix/store/mkm79sly7cprcs8wl0rq4icyhrpw21sp-run-check-harness-psql-15.drv'.6 Reason: builder failed with exit code 1.7 Output paths:8 /nix/store/izpvlrnsirc271lxbxzmhpr0d6my0l4m-run-check-harness-psql-159 Last 25 log lines:10 > test supautils_restrict_versions ... ok 84 ms11 > test vault ... ok 28 ms12 > test wal2json ... ok 14 ms13 > test z_15_ext_interface ... FAILED 626 ms14 > test z_15_intarray_ltree_query ... ok 13 ms15 > test z_15_pg_stat_monitor ... ok 13 ms16 > test z_15_pgjwt ... ok 19 ms17 > test z_15_pgvector ... ok 32 ms18 > test z_15_plv8 ... ok 48 ms19 > test z_15_roles ... ok 18 ms20 > test z_15_rum ... ok 19 ms21 > test z_15_timescale ... ok 22 ms22 > test z_15_unhype_timescale_to_partman ... ok 11361 ms23 >24 > =======================25 > 2 of 72 tests failed.26 > =======================27 >28 > The differences that caused some tests to fail can be viewed in the29 > file "/nix/store/izpvlrnsirc271lxbxzmhpr0d6my0l4m-run-check-harness-psql-15/regression_output/regression.diffs". A copy of the test summary that you see30 > above is saved in the file "/nix/store/izpvlrnsirc271lxbxzmhpr0d6my0l4m-run-check-harness-psql-15/regression_output/regression.out".31 >32 > 2026-10-07 23:26:58 [ERROR] pg_regress tests failed33 > 2026-10-07 23:26:58 [ERROR] An error occurred. Exit code: 134 > 2026-10-07 23:26:58 [ERROR] Debug logs:35 For full logs, run:36 nix log /nix/store/mkm79sly7cprcs8wl0rq4icyhrpw21sp-run-check-harness-psql-15.drv