this derivation will be built: /nix/store/mkm79sly7cprcs8wl0rq4icyhrpw21sp-run-check-harness-psql-15.drv this path will be fetched (4.5 KiB download, 16.2 KiB unpacked): /nix/store/di0giz2qyy74pd4s3f23lxpqspadjzdi-postgres-15-check-harness error: Cannot build '/nix/store/mkm79sly7cprcs8wl0rq4icyhrpw21sp-run-check-harness-psql-15.drv'. Reason: builder failed with exit code 1. Output paths: /nix/store/izpvlrnsirc271lxbxzmhpr0d6my0l4m-run-check-harness-psql-15 Last 25 log lines: > test supautils_restrict_versions ... ok 84 ms > test vault ... ok 28 ms > test wal2json ... ok 14 ms > test z_15_ext_interface ... FAILED 626 ms > test z_15_intarray_ltree_query ... ok 13 ms > test z_15_pg_stat_monitor ... ok 13 ms > test z_15_pgjwt ... ok 19 ms > test z_15_pgvector ... ok 32 ms > test z_15_plv8 ... ok 48 ms > test z_15_roles ... ok 18 ms > test z_15_rum ... ok 19 ms > test z_15_timescale ... ok 22 ms > test z_15_unhype_timescale_to_partman ... ok 11361 ms > > ======================= > 2 of 72 tests failed. > ======================= > > The differences that caused some tests to fail can be viewed in the > file "/nix/store/izpvlrnsirc271lxbxzmhpr0d6my0l4m-run-check-harness-psql-15/regression_output/regression.diffs". A copy of the test summary that you see > above is saved in the file "/nix/store/izpvlrnsirc271lxbxzmhpr0d6my0l4m-run-check-harness-psql-15/regression_output/regression.out". > > 2026-10-07 23:26:58 [ERROR] pg_regress tests failed > 2026-10-07 23:26:58 [ERROR] An error occurred. Exit code: 1 > 2026-10-07 23:26:58 [ERROR] Debug logs: For full logs, run: nix log /nix/store/mkm79sly7cprcs8wl0rq4icyhrpw21sp-run-check-harness-psql-15.drv