1these 2 derivations will be built:2 /nix/store/lr6sw0w7g0wagbi4ld0lsdb5lyqgs3kh-postgres-orioledb-17-check-harness.drv3 /nix/store/kv26mcp2f1zy35kb1qx7ib0z1k71wsr0-run-check-harness-psql-orioledb-17.drv4error: Cannot build '/nix/store/kv26mcp2f1zy35kb1qx7ib0z1k71wsr0-run-check-harness-psql-orioledb-17.drv'.5 Reason: builder failed with exit code 1.6 Output paths:7 /nix/store/6b9ynxd8ca6y62iqrmimjajyympfm5i9-run-check-harness-psql-orioledb-178 Last 25 log lines:9 > test wal2json ... ok 18 ms10 > test z_orioledb-17_docs-cascades-deletes ... ok 82 ms11 > test z_orioledb-17_docs-full-text-search ... ok 30 ms12 > test z_orioledb-17_docs-functions ... ok 256 ms13 > test z_orioledb-17_docs-indexes ... ok 27 ms14 > test z_orioledb-17_docs-partitioning ... ok 37 ms15 > test z_orioledb-17_ext_interface ... FAILED 110 ms16 > test z_orioledb-17_extensions_schema ... ok 10 ms17 > test z_orioledb-17_intarray_ltree_query ... ok 10 ms18 > test z_orioledb-17_pg_stat_monitor ... ok 7 ms19 > test z_orioledb-17_pgroonga ... ok 55 ms20 > test z_orioledb-17_pgvector ... ok 17 ms21 > test z_orioledb-17_verify_orioledb ... ok 17 ms22 >23 > =======================24 > 2 of 65 tests failed.25 > =======================26 >27 > The differences that caused some tests to fail can be viewed in the28 > file "/nix/store/6b9ynxd8ca6y62iqrmimjajyympfm5i9-run-check-harness-psql-orioledb-17/regression_output/regression.diffs". A copy of the test summary that you see29 > above is saved in the file "/nix/store/6b9ynxd8ca6y62iqrmimjajyympfm5i9-run-check-harness-psql-orioledb-17/regression_output/regression.out".30 >31 > 2026-10-07 22:14:50 [ERROR] pg_regress tests failed32 > 2026-10-07 22:14:50 [ERROR] An error occurred. Exit code: 133 > 2026-10-07 22:14:50 [ERROR] Debug logs:34 For full logs, run:35 nix log /nix/store/kv26mcp2f1zy35kb1qx7ib0z1k71wsr0-run-check-harness-psql-orioledb-17.drv