these 2 derivations will be built: /nix/store/lr6sw0w7g0wagbi4ld0lsdb5lyqgs3kh-postgres-orioledb-17-check-harness.drv /nix/store/kv26mcp2f1zy35kb1qx7ib0z1k71wsr0-run-check-harness-psql-orioledb-17.drv error: Cannot build '/nix/store/kv26mcp2f1zy35kb1qx7ib0z1k71wsr0-run-check-harness-psql-orioledb-17.drv'. Reason: builder failed with exit code 1. Output paths: /nix/store/6b9ynxd8ca6y62iqrmimjajyympfm5i9-run-check-harness-psql-orioledb-17 Last 25 log lines: > test wal2json ... ok 18 ms > test z_orioledb-17_docs-cascades-deletes ... ok 82 ms > test z_orioledb-17_docs-full-text-search ... ok 30 ms > test z_orioledb-17_docs-functions ... ok 256 ms > test z_orioledb-17_docs-indexes ... ok 27 ms > test z_orioledb-17_docs-partitioning ... ok 37 ms > test z_orioledb-17_ext_interface ... FAILED 110 ms > test z_orioledb-17_extensions_schema ... ok 10 ms > test z_orioledb-17_intarray_ltree_query ... ok 10 ms > test z_orioledb-17_pg_stat_monitor ... ok 7 ms > test z_orioledb-17_pgroonga ... ok 55 ms > test z_orioledb-17_pgvector ... ok 17 ms > test z_orioledb-17_verify_orioledb ... ok 17 ms > > ======================= > 2 of 65 tests failed. > ======================= > > The differences that caused some tests to fail can be viewed in the > file "/nix/store/6b9ynxd8ca6y62iqrmimjajyympfm5i9-run-check-harness-psql-orioledb-17/regression_output/regression.diffs". A copy of the test summary that you see > above is saved in the file "/nix/store/6b9ynxd8ca6y62iqrmimjajyympfm5i9-run-check-harness-psql-orioledb-17/regression_output/regression.out". > > 2026-10-07 22:14:50 [ERROR] pg_regress tests failed > 2026-10-07 22:14:50 [ERROR] An error occurred. Exit code: 1 > 2026-10-07 22:14:50 [ERROR] Debug logs: For full logs, run: nix log /nix/store/kv26mcp2f1zy35kb1qx7ib0z1k71wsr0-run-check-harness-psql-orioledb-17.drv