setup
checks.x86_64-linux.psql_17_slim
· build #167
· raw
1these 2 derivations will be built:2 /nix/store/x5ddmbw82in20mwajp2b0nd44bl4hzqb-postgres-17-check-harness.drv3 /nix/store/0vqdaniwd3gs0dfzkwk8prqfwq5r1zq3-run-check-harness-psql-17-slim.drv4error: Cannot build '/nix/store/0vqdaniwd3gs0dfzkwk8prqfwq5r1zq3-run-check-harness-psql-17-slim.drv'.5 Reason: builder failed with exit code 1.6 Output paths:7 /nix/store/2v0c3brjfn77qkf6y64jxrgrmsinsw2v-run-check-harness-psql-17-slim8 Last 25 log lines:9 > test roles ... ok 11 ms10 > test security ... ok 9 ms11 > test storage ... ok 14 ms12 > test supautils_reserved_roles ... ok 7 ms13 > test supautils_restrict_versions ... ok 80 ms14 > test vault ... ok 27 ms15 > test wal2json ... ok 13 ms16 > test z_17_ext_interface ... FAILED 110 ms17 > test z_17_intarray_ltree_query ... ok 14 ms18 > test z_17_pg_stat_monitor ... ok 8 ms19 > test z_17_pgvector ... ok 13 ms20 > test z_17_roles ... ok 15 ms21 > test z_17_rum ... ok 15 ms22 >23 > =======================24 > 2 of 68 tests failed.25 > =======================26 >27 > The differences that caused some tests to fail can be viewed in the28 > file "/nix/store/2v0c3brjfn77qkf6y64jxrgrmsinsw2v-run-check-harness-psql-17-slim/regression_output/regression.diffs". A copy of the test summary that you see29 > above is saved in the file "/nix/store/2v0c3brjfn77qkf6y64jxrgrmsinsw2v-run-check-harness-psql-17-slim/regression_output/regression.out".30 >31 > 2026-10-07 22:14:20 [ERROR] pg_regress tests failed32 > 2026-10-07 22:14:20 [ERROR] An error occurred. Exit code: 133 > 2026-10-07 22:14:20 [ERROR] Debug logs:34 For full logs, run:35 nix log /nix/store/0vqdaniwd3gs0dfzkwk8prqfwq5r1zq3-run-check-harness-psql-17-slim.drv