these 2 derivations will be built: /nix/store/x5ddmbw82in20mwajp2b0nd44bl4hzqb-postgres-17-check-harness.drv /nix/store/0vqdaniwd3gs0dfzkwk8prqfwq5r1zq3-run-check-harness-psql-17-slim.drv error: Cannot build '/nix/store/0vqdaniwd3gs0dfzkwk8prqfwq5r1zq3-run-check-harness-psql-17-slim.drv'. Reason: builder failed with exit code 1. Output paths: /nix/store/2v0c3brjfn77qkf6y64jxrgrmsinsw2v-run-check-harness-psql-17-slim Last 25 log lines: > test roles ... ok 11 ms > test security ... ok 9 ms > test storage ... ok 14 ms > test supautils_reserved_roles ... ok 7 ms > test supautils_restrict_versions ... ok 80 ms > test vault ... ok 27 ms > test wal2json ... ok 13 ms > test z_17_ext_interface ... FAILED 110 ms > test z_17_intarray_ltree_query ... ok 14 ms > test z_17_pg_stat_monitor ... ok 8 ms > test z_17_pgvector ... ok 13 ms > test z_17_roles ... ok 15 ms > test z_17_rum ... ok 15 ms > > ======================= > 2 of 68 tests failed. > ======================= > > The differences that caused some tests to fail can be viewed in the > file "/nix/store/2v0c3brjfn77qkf6y64jxrgrmsinsw2v-run-check-harness-psql-17-slim/regression_output/regression.diffs". A copy of the test summary that you see > above is saved in the file "/nix/store/2v0c3brjfn77qkf6y64jxrgrmsinsw2v-run-check-harness-psql-17-slim/regression_output/regression.out". > > 2026-10-07 22:14:20 [ERROR] pg_regress tests failed > 2026-10-07 22:14:20 [ERROR] An error occurred. Exit code: 1 > 2026-10-07 22:14:20 [ERROR] Debug logs: For full logs, run: nix log /nix/store/0vqdaniwd3gs0dfzkwk8prqfwq5r1zq3-run-check-harness-psql-17-slim.drv