setup
checks.x86_64-linux.psql_17
· build #167
· raw
1these 2 derivations will be built:2 /nix/store/fqdx5n9jrn6hxpn5ppqqflxh146c1ds4-postgres-17-check-harness.drv3 /nix/store/nkzk4skm3l16iqmfrb5di3g5i740m3pk-run-check-harness-psql-17.drv4error: Cannot build '/nix/store/nkzk4skm3l16iqmfrb5di3g5i740m3pk-run-check-harness-psql-17.drv'.5 Reason: builder failed with exit code 1.6 Output paths:7 /nix/store/dadgs0ndsn7v218x9mdg804mmf4kj7k6-run-check-harness-psql-178 Last 25 log lines:9 > test roles ... ok 12 ms10 > test security ... ok 10 ms11 > test storage ... ok 15 ms12 > test supautils_reserved_roles ... ok 7 ms13 > test supautils_restrict_versions ... ok 80 ms14 > test vault ... ok 28 ms15 > test wal2json ... ok 14 ms16 > test z_17_ext_interface ... FAILED 111 ms17 > test z_17_intarray_ltree_query ... ok 14 ms18 > test z_17_pg_stat_monitor ... ok 9 ms19 > test z_17_pgvector ... ok 15 ms20 > test z_17_roles ... ok 14 ms21 > test z_17_rum ... ok 14 ms22 >23 > =======================24 > 2 of 68 tests failed.25 > =======================26 >27 > The differences that caused some tests to fail can be viewed in the28 > file "/nix/store/dadgs0ndsn7v218x9mdg804mmf4kj7k6-run-check-harness-psql-17/regression_output/regression.diffs". A copy of the test summary that you see29 > above is saved in the file "/nix/store/dadgs0ndsn7v218x9mdg804mmf4kj7k6-run-check-harness-psql-17/regression_output/regression.out".30 >31 > 2026-10-07 22:14:23 [ERROR] pg_regress tests failed32 > 2026-10-07 22:14:23 [ERROR] An error occurred. Exit code: 133 > 2026-10-07 22:14:23 [ERROR] Debug logs:34 For full logs, run:35 nix log /nix/store/nkzk4skm3l16iqmfrb5di3g5i740m3pk-run-check-harness-psql-17.drv