these 2 derivations will be built: /nix/store/fqdx5n9jrn6hxpn5ppqqflxh146c1ds4-postgres-17-check-harness.drv /nix/store/nkzk4skm3l16iqmfrb5di3g5i740m3pk-run-check-harness-psql-17.drv error: Cannot build '/nix/store/nkzk4skm3l16iqmfrb5di3g5i740m3pk-run-check-harness-psql-17.drv'. Reason: builder failed with exit code 1. Output paths: /nix/store/dadgs0ndsn7v218x9mdg804mmf4kj7k6-run-check-harness-psql-17 Last 25 log lines: > test roles ... ok 12 ms > test security ... ok 10 ms > test storage ... ok 15 ms > test supautils_reserved_roles ... ok 7 ms > test supautils_restrict_versions ... ok 80 ms > test vault ... ok 28 ms > test wal2json ... ok 14 ms > test z_17_ext_interface ... FAILED 111 ms > test z_17_intarray_ltree_query ... ok 14 ms > test z_17_pg_stat_monitor ... ok 9 ms > test z_17_pgvector ... ok 15 ms > test z_17_roles ... ok 14 ms > test z_17_rum ... ok 14 ms > > ======================= > 2 of 68 tests failed. > ======================= > > The differences that caused some tests to fail can be viewed in the > file "/nix/store/dadgs0ndsn7v218x9mdg804mmf4kj7k6-run-check-harness-psql-17/regression_output/regression.diffs". A copy of the test summary that you see > above is saved in the file "/nix/store/dadgs0ndsn7v218x9mdg804mmf4kj7k6-run-check-harness-psql-17/regression_output/regression.out". > > 2026-10-07 22:14:23 [ERROR] pg_regress tests failed > 2026-10-07 22:14:23 [ERROR] An error occurred. Exit code: 1 > 2026-10-07 22:14:23 [ERROR] Debug logs: For full logs, run: nix log /nix/store/nkzk4skm3l16iqmfrb5di3g5i740m3pk-run-check-harness-psql-17.drv