setup
checks.x86_64-linux.psql_15_slim
· build #167
· raw
1these 2 derivations will be built:2 /nix/store/zxjfvbq9rb9rdjn45r7pkrcmh1mb9nrb-postgres-15-check-harness.drv3 /nix/store/0hk1g9jmqc8mrqkw0wm0xji1cy46ddmh-run-check-harness-psql-15-slim.drv4error: Cannot build '/nix/store/0hk1g9jmqc8mrqkw0wm0xji1cy46ddmh-run-check-harness-psql-15-slim.drv'.5 Reason: builder failed with exit code 1.6 Output paths:7 /nix/store/xpw0v0rascrw6qk37z3wb493bvjznj25-run-check-harness-psql-15-slim8 Last 25 log lines:9 > test supautils_restrict_versions ... ok 84 ms10 > test vault ... ok 31 ms11 > test wal2json ... ok 16 ms12 > test z_15_ext_interface ... FAILED 650 ms13 > test z_15_intarray_ltree_query ... ok 11 ms14 > test z_15_pg_stat_monitor ... ok 11 ms15 > test z_15_pgjwt ... ok 18 ms16 > test z_15_pgvector ... ok 33 ms17 > test z_15_plv8 ... ok 53 ms18 > test z_15_roles ... ok 18 ms19 > test z_15_rum ... ok 24 ms20 > test z_15_timescale ... ok 23 ms21 > test z_15_unhype_timescale_to_partman ... ok 11410 ms22 >23 > =======================24 > 2 of 72 tests failed.25 > =======================26 >27 > The differences that caused some tests to fail can be viewed in the28 > file "/nix/store/xpw0v0rascrw6qk37z3wb493bvjznj25-run-check-harness-psql-15-slim/regression_output/regression.diffs". A copy of the test summary that you see29 > above is saved in the file "/nix/store/xpw0v0rascrw6qk37z3wb493bvjznj25-run-check-harness-psql-15-slim/regression_output/regression.out".30 >31 > 2026-10-07 22:14:53 [ERROR] pg_regress tests failed32 > 2026-10-07 22:14:53 [ERROR] An error occurred. Exit code: 133 > 2026-10-07 22:14:53 [ERROR] Debug logs:34 For full logs, run:35 nix log /nix/store/0hk1g9jmqc8mrqkw0wm0xji1cy46ddmh-run-check-harness-psql-15-slim.drv