these 2 derivations will be built: /nix/store/zxjfvbq9rb9rdjn45r7pkrcmh1mb9nrb-postgres-15-check-harness.drv /nix/store/0hk1g9jmqc8mrqkw0wm0xji1cy46ddmh-run-check-harness-psql-15-slim.drv error: Cannot build '/nix/store/0hk1g9jmqc8mrqkw0wm0xji1cy46ddmh-run-check-harness-psql-15-slim.drv'. Reason: builder failed with exit code 1. Output paths: /nix/store/xpw0v0rascrw6qk37z3wb493bvjznj25-run-check-harness-psql-15-slim Last 25 log lines: > test supautils_restrict_versions ... ok 84 ms > test vault ... ok 31 ms > test wal2json ... ok 16 ms > test z_15_ext_interface ... FAILED 650 ms > test z_15_intarray_ltree_query ... ok 11 ms > test z_15_pg_stat_monitor ... ok 11 ms > test z_15_pgjwt ... ok 18 ms > test z_15_pgvector ... ok 33 ms > test z_15_plv8 ... ok 53 ms > test z_15_roles ... ok 18 ms > test z_15_rum ... ok 24 ms > test z_15_timescale ... ok 23 ms > test z_15_unhype_timescale_to_partman ... ok 11410 ms > > ======================= > 2 of 72 tests failed. > ======================= > > The differences that caused some tests to fail can be viewed in the > file "/nix/store/xpw0v0rascrw6qk37z3wb493bvjznj25-run-check-harness-psql-15-slim/regression_output/regression.diffs". A copy of the test summary that you see > above is saved in the file "/nix/store/xpw0v0rascrw6qk37z3wb493bvjznj25-run-check-harness-psql-15-slim/regression_output/regression.out". > > 2026-10-07 22:14:53 [ERROR] pg_regress tests failed > 2026-10-07 22:14:53 [ERROR] An error occurred. Exit code: 1 > 2026-10-07 22:14:53 [ERROR] Debug logs: For full logs, run: nix log /nix/store/0hk1g9jmqc8mrqkw0wm0xji1cy46ddmh-run-check-harness-psql-15-slim.drv