nixbot

builds
1this derivation will be built:2 /nix/store/1fr943g8ddxk2fppyvgkck857mar8k04-run-check-harness-psql-15-slim.drv3these 2 paths will be fetched (23.3 KiB download, 92.5 KiB unpacked):4 /nix/store/11dikpp94v9jaclp9f5gmqmpavyaj654-postgres-15-check-harness5 /nix/store/03wnzmq8rdb486z9jhvpa3v61abj6zzl-start-postgres-server-test6error: Cannot build '/nix/store/1fr943g8ddxk2fppyvgkck857mar8k04-run-check-harness-psql-15-slim.drv'.7 Reason: builder failed with exit code 1.8 Output paths:9 /nix/store/fh5d1wqadsw6jp4z87vl0ml6fifn40dp-run-check-harness-psql-15-slim10 Last 25 log lines:11 > test supautils_restrict_versions ... ok 85 ms12 > test vault ... ok 29 ms13 > test wal2json ... ok 14 ms14 > test z_15_ext_interface ... FAILED 627 ms15 > test z_15_intarray_ltree_query ... ok 13 ms16 > test z_15_pg_stat_monitor ... ok 12 ms17 > test z_15_pgjwt ... ok 20 ms18 > test z_15_pgvector ... ok 36 ms19 > test z_15_plv8 ... ok 51 ms20 > test z_15_roles ... ok 17 ms21 > test z_15_rum ... ok 18 ms22 > test z_15_timescale ... ok 22 ms23 > test z_15_unhype_timescale_to_partman ... ok 11956 ms24 >25 > =======================26 > 2 of 72 tests failed.27 > =======================28 >29 > The differences that caused some tests to fail can be viewed in the30 > file "/nix/store/fh5d1wqadsw6jp4z87vl0ml6fifn40dp-run-check-harness-psql-15-slim/regression_output/regression.diffs". A copy of the test summary that you see31 > above is saved in the file "/nix/store/fh5d1wqadsw6jp4z87vl0ml6fifn40dp-run-check-harness-psql-15-slim/regression_output/regression.out".32 >33 > 2026-10-07 21:55:08 [ERROR] pg_regress tests failed34 > 2026-10-07 21:55:08 [ERROR] An error occurred. Exit code: 135 > 2026-10-07 21:55:09 [ERROR] Debug logs:36 For full logs, run:37 nix log /nix/store/1fr943g8ddxk2fppyvgkck857mar8k04-run-check-harness-psql-15-slim.drv